##TITLE=abcd
##JCAMPDX= 6.0         $$ Bruker NMR JCAMP-DX V2.0
##DATA TYPE= NMR SPECTRUM
##DATA CLASS= NTUPLES
##ORIGIN= UXNMR, Bruker Analytische Messtechnik GmbH
##OWNER= root
$$ XWIN-NMR		Version 3.5
$$ Thu Dec 11 17:01:50 2025 Russian Standard Time (UT+4h)  servis@DPX200
##.OBSERVE FREQUENCY= 200.131235884673
##.OBSERVE NUCLEUS= ^1H
##.ACQUISITION MODE= SIMULTANEOUS
##.ACQUISITION SCHEME= undefined
##.AVERAGES= 24
##.DIGITISER RES= 18
##SPECTROMETER/DATA SYSTEM= spect
##.PULSE SEQUENCE= zg
##.SOLVENT NAME= CDCl3
##.SHIFT REFERENCE= (INTERNAL, CDCl3, 0, 16.4885)
##AUDIT TRAIL= $$ (NUMBER, WHEN, WHO, WHERE, WHAT)
$$ ##TITLE= Audit trail, XWIN-NMR		Version 3.5
$$ ##JCAMPDX= 5.01
$$ ##ORIGIN= Bruker BioSpin GmbH
$$ ##OWNER= servis
$$ F:\spectra/data/av/nmr/H1/1/pdata/1/auditp.txt
$$ ##AUDIT TRAIL=  $$ (NUMBER, WHEN, WHO, WHERE, WHAT)
(   1,<2025-12-11 17:01:15.09 +0400>,<servis>,<DPX200>,
      <created by zg, POWCHK disabled, PULCHK disabled
       terminated by command 'halt'
       configuration hash MD5:
       00 E9 B6 7A A2 85 ED C7 34 08 36 98 17 FE 4E 26
       data hash MD5: 32K
       64 25 60 BB 88 22 02 DC 15 A3 52 45 F9 8D AD 4D>)
(   2,<2025-12-11 17:01:16.87 +0400>,<servis>,<DPX200>,
      <Start of raw data processing
       efp BC_mod = 2 LB = 0.05 FT_mod = 6 PKNL = 1 PHC0 = -261.6463 PHC1 = 6.301564 SI = 16K 
       data hash MD5: 16K
       96 EA 6B 6B 1B 7F 5A 48 7E 73 0B 32 86 91 14 73>)
(   3,<2025-12-11 17:01:30.00 +0400>,<servis>,<DPX200>,
      <pk PHC0 = -1.6 PHC1 = 0 
       data hash MD5: 16K
       CE CE D2 4B 9B 9A 6E 8D B3 24 31 01 91 84 1B BC>)
$$ ##END=
$$ 
$$ hash MD5
$$ 20 71 43 72 97 AA 52 E9 D0 E0 0E 80 D5 23 BF C2
##$RELAX= 
##$RELAX= 
##$RELAX= 
##$RELAX= 
##$RELAX= 
##$RELAX= 
##$RELAX= 
##$RELAX= 
$$ Bruker specific parameters
$$ --------------------------
##$DU= <F:\spectra>
##$EXPNO= 1
##$NAME= <H1>
##$PROCNO= 1
##$TYPE= <nmr>
##$USER= <av>
##$AMP= (0..31)
100 100 100 100 100 100 100 100 100 100 100 100 100 100 100 100 100 100 
100 100 100 100 100 100 100 100 100 100 100 100 100 100 
##$AQSEQ= 0
##$AQ_mod= 1
##$AUNM= <au_zg>
##$AUTOPOS= <>
##$BF1= 200.13
##$BF2= 200.13
##$BF3= 200.13
##$BF4= 200.13
##$BF5= 500.13
##$BF6= 500.13
##$BF7= 500.13
##$BF8= 500.13
##$BYTORDA= 1
##$CFDGTYP= 0
##$CFRGTYP= 5
##$CHEMSTR= <none>
##$CNST= (0..31)
1 1 145 1 1 1 1 1 1 1 1 1 1 1 1 1 1 1 1 1 1 1 1 1 1 1 1 1 1 1 1 1 
##$CPDPRG= <>
##$CPDPRG1= <>
##$CPDPRG2= <>
##$CPDPRG3= <>
##$CPDPRG4= <mlev>
##$CPDPRG5= <mlev>
##$CPDPRG6= <mlev>
##$CPDPRG7= <mlev>
##$CPDPRG8= <mlev>
##$CPDPRGB= <>
##$CPDPRGT= <>
##$D= (0..31)
0 2 0 0 0 0 0 0 0 0.06 0 0 0 0 0 0 0.0002 0 0 0 0 0 0 0 0 0 0 0 0 0 0 
0 
##$DATE= 1765458074
##$DBL= (0..7)
120 120 120 120 120 120 120 120 
##$DBP= (0..7)
150 150 150 150 150 150 150 150 
##$DBP07= 0
##$DBPNAM0= <>
##$DBPNAM1= <>
##$DBPNAM2= <>
##$DBPNAM3= <>
##$DBPNAM4= <>
##$DBPNAM5= <>
##$DBPNAM6= <>
##$DBPNAM7= <>
##$DBPOAL= (0..7)
0.5 0.5 0.5 0.5 0.5 0.5 0.5 0.5 
##$DBPOFFS= (0..7)
0 0 0 0 0 0 0 0 
$$ [...]
##$SUBNAM4= <"">
##$SUBNAM5= <"">
##$SUBNAM6= <"">
##$SUBNAM7= <"">
##$SUBNAM8= <"">
##$SUBNAM9= <"">
##$SW= 20.6817932712277
##$SWIBOX= (0..15)
0 0 3 0 0 0 0 0 0 0 0 0 0 0 0 0 
##$SW_h= 4139.07284768212
##$TD= 32768
##$TD0= 1
##$TE= 0
##$TE2= 300
##$TE3= 300
##$TEG= 300
##$TL= (0..7)
0 120 120 120 120 120 120 120 
##$TP= (0..7)
150 150 150 150 150 150 150 150 
##$TP07= 0
##$TPNAME0= <>
##$TPNAME1= <>
##$TPNAME2= <>
##$TPNAME3= <>
##$TPNAME4= <>
##$TPNAME5= <>
##$TPNAME6= <>
##$TPNAME7= <>
##$TPOAL= (0..7)
0.5 0.5 0.5 0.5 0.5 0.5 0.5 0.5 
##$TPOFFS= (0..7)
0 0 0 0 0 0 0 0 
##$TUNHIN= 0
##$TUNHOUT= 0
##$TUNXOUT= 0
##$USERA1= <user>
##$USERA2= <user>
##$USERA3= <user>
##$USERA4= <user>
##$USERA5= <user>
##$V9= 5
##$VALIST= <valist>
##$VCLIST= <CCCCCCCCCCCCCCC>
##$VD= 0
##$VDLIST= <DDDDDDDDDDDDDDD>
##$VPLIST= <PPPPPPPPPPPPPPP>
##$VTLIST= <TTTTTTTTTTTTTTT>
##$WBST= 1024
##$WBSW= 30
##$XGAIN= (0..3)
0 0 0 0 
##$XL= 0
##$YL= 0
##$YMAX_a= 1263284
##$YMIN_a= -1147755
##$ZGOPTNS= <>
##$ZL1= 120
##$ZL2= 120
##$ZL3= 120
##$ZL4= 120
##$ABSF1= 0
##$ABSF2= 0
##$ABSG= 0
##$ABSL= 0
##$ALPHA= 0
##$AQORDER= 0
##$ASSFAC= 0
##$ASSFACI= 0
##$ASSFACX= 0
##$ASSWID= 0
##$AUNMP= <proc_1d>
##$AZFE= 0.1
##$AZFW= 0.1
##$BCFW= 0
##$BC_mod= 2
##$BYTORDP= 0
##$COROFFS= 0
##$CY= 18.4799938201904
##$DATMOD= 1
##$DC= 0
##$DFILT= <>
##$DTYPP= 0
##$F1P= 9.9274215381318
##$F2P= -0.165520771350173
##$FCOR= 1
##$FTSIZE= 16384
##$FT_mod= 6
##$GAMMA= 0
##$GB= 0
##$INTBC= 1
##$INTSCL= 4.127829e-11
##$ISEN= 128
##$LB= 0.05
##$LEV0= 0
##$LPBIN= 0
##$MAXI= 10000
##$MC2= 0
##$MEAN= 0
##$ME_mod= 0
##$MI= 50
##$NCOEF= 0
##$NC_proc= -5
##$NLEV= 6
##$NOISF1= 3.799351
##$NOISF2= 2.8
##$NSP= 0
##$NTH_PI= 0
##$NZP= 0
##$OFFSET= 16.48848
##$PC= 4
##$PHC0= -263.2463
##$PHC1= 6.301564
##$PH_mod= 1
##$PKNL= yes
##$PPARMOD= 0
##$PSCAL= 4
##$PSIGN= 0
##$REVERSE= no
##$SF= 200.130005582386
##$SI= 16384
##$SIGF1= 3
##$SIGF2= 2
##$SINO= 400
##$SIOLD= 16384
##$SREGLST= <1H.CDCl3>
##$SSB= 0
##$STSI= 16384
##$STSR= 0
##$SW_p= 4139.07284768211
##$SYMM= 0
##$S_DEV= 0
##$TDeff= 32768
##$TDoff= 0
##$TI= <>
##$TILT= no
##$TM1= 0
##$TM2= 0
##$TOPLEV= 0
##$USERP1= <user>
##$USERP2= <user>
##$USERP3= <user>
##$USERP4= <user>
##$USERP5= <user>
##$WDW= 1
##$XDIM= 16384
##$YMAX_p= 301278053
##$YMIN_p= -1097329
$$ End of Bruker specific parameters
$$ ---------------------------------
##NTUPLES= NMR SPECTRUM
##VAR_NAME=  FREQUENCY,     SPECTRUM/REAL,   SPECTRUM/IMAG
##SYMBOL=    X,             R,               I
##VAR_TYPE=  INDEPENDENT,   DEPENDENT,       DEPENDENT
##VAR_FORM=  AFFN,          ASDF,            ASDF
##VAR_DIM=   16384,         16384,           16384
##UNITS=     HZ,            ARBITRARY UNITS, ARBITRARY UNITS
##FACTOR=    0.252644378177508, 1,           1
##FIRST=     3299.83951724647, 0,            0
##LAST=      -839.233330435636, 0,           0
##MIN=       -839.233330435636, -1097329,    0
##MAX=       3299.83951724647, 301278053,    0
$$ Real data points
##PAGE= N=1
##DATA TABLE= (X++(R..R)), XYDATA
$$ [...]
$$ plain form
7566 -409970 -429893 -364666 -332807 -324369 -370675 -271194 -337741 -335586 -296434 -302902 -291196 -298011
7554 -298011 -336103 -317548 -359960 -291629 -292779 -312401 -333440 -283078 -370173 -313669 -340703 -406802
7542 -406802 -321667 -328626 -355155 -328840 -323244 -377335 -437514 -300299 -301286 -344028 -342539 -248691
7530 -248691 -344190 -280799 -354121 -353189 -362564 -251391 -310709 -247126 -286990 -346157 -347014 -386142
7518 -386142 -282344 -426199 -380538 -389326 -347906 -382872 -351864 -354041 -325817 -253087 -298323 -344566
7506 -344566 -321140 -234093 -227526 -249228 -307354 -250535 -306290 -297254 -309828 -352464 -283816 -177094
7494 -177094 -212866 -277816 -240192 -267228 -277272 -243939 -206297 -198541 -251389 -231675 -209713 -247565
7482 -247565 -233821 -226803 -170274 -178948 -249942 -137700 -237342 -244912 -198500 -288985 -236755 -220084
$$ packed form
7566d09970j9923O5227L1859Q438m6306R9481o6547K155L9152o468J1706o815
7554b98011l8092J8555m2412O8331j150j9622k1039N0362q7095N6504k7034o6099
7542d06802Q5135o959k6529K6315N596n4091o0179J37215r87m2742J489R3848
7530b48691r5499O3391p3322R32r375J11173n9318O3583l9864n9167q57l9128
7518c86142J03798j43855M5661q788M1420l4966L1008k177K8224P2730m5236m6243
7506c44566K3426Q7047O567k1702n8126N6819n5755R036j2574m2636O8648J06722
7494a77094l5772o4950L7624k7036j0044L3333L7642P756n2848J9714K1962l7852
7482b47565J3744P018N6529q674p0994J12242r9642p570M6412r0485N2230J6671
$$ plain form
7470 -220084 -247160 -250638 -80419 -147714 -194621 -193225 -204469 -213461 -139231 -237842 -234178 -234354 -185320
7457 -185320 -199782 -226166 -262673 -218549 -255957 -233055 -256491 -258917 -325431 -287973 -211450 -277729
7445 -277729 -273852 -248873 -308771 -282626 -310380 -290568 -275754 -277029 -277352 -304233 -302013 -233547 -293706
7432 -293706 -298938 -267510 -281798 -271293 -222207 -299514 -263661 -268733 -322662 -256171 -263408 -267912
7420 -267912 -324228 -194208 -215038 -287922 -166668 -267983 -228100 -255625 -237755 -217788 -301796
7409 -301796 -255447 -220505 -191442 -214398 -296095 -306844 -314215 -312567 -218789 -271889 -233404 -260431
7397 -260431 -270387 -303591 -312155 -231651 -275522 -230423 -279866 -327117 -287823 -241967 -218875 -272141
7385 -272141 -255089 -278362 -250547 -311807 -225055 -304064 -348236 -352385 -325951 -330420 -332498 -321883
$$ packed form
7470b20084k7076l478J70219o7295m6907J396j1244q992P4230r8611L664j76M9034
7457a85320j4462k6384l6507M4124l7408K2902k3436k426o6514L7458P6523o6279
7445b77729L877K4979n9898K6145k7754J9812J4814j275l23k6881K220O8466o0159
7432b93706n232L1428j4288J0505M9086p7307L5853n072n3929O6491p237m504
7420b67912n6316J30020k0830p2884J21254j01315L9883k7525J7870J9967q4008
7409c01796M6349L4942K9063k2956q1697j0749p371J648R3778n3100L8485k7027
7397b60431r956l3204q564Q0504m3871M5099m9443m7251L9294M5856K3092n3266
7385b72141J7052k3273K7815o1260Q6752p9009m4172m149K6434m469k078J0615
$$ plain form
7373 -321883 -279984 -289727 -258476 -297386 -295899 -347911 -298679 -388853 -299965 -326520 -355174 -320337
7361 -320337 -269764 -285533 -331852 -307777 -371311 -299329 -226935 -307156 -265877 -195458 -329774
7350 -329774 -302993 -263898 -310100 -182547 -199611 -263079 -258087 -291752 -245097 -280492 -245441 -206108
7338 -206108 -248335 -256592 -184342 -225601 -173806 -156896 -142980 -233444 -207268 -207861 -266026 -237175
7326 -237175 -250622 -231682 -204910 -283245 -248662 -399221 -233899 -331996 -257549 -328932 -276184
7315 -276184 -224284 -283109 -263590 -228740 -223000 -200190 -251355 -296972 -257561 -200254 -253377 -329678
7303 -329678 -268001 -200051 -265065 -225239 -238546 -293562 -239721 -228586 -225608 -225334 -208729 -279567
7291 -279567 -255320 -223413 -224512 -285185 -274118 -282647 -174524 -241735 -227617 -109578 -327547
$$ packed form
7373c21883M1899r743L1251l8910J487n2012M9232r0174Q8888k6555k8654L4837
7361c20337N0573j5769m6319K4075o3534P1982P2394q0221M1279P0419j34316
7350c29774K6781L9095m6202J27553j7064o3468M992l3665M6655l5395L5051L9333
7338b06108m2227q257P2250m1259N1795J6910J3916r0464K6176n93n8165K8851
7326b37175j3447J8940K6772p8335L4583j50559J65322r8097P4447p1383N2748
7315b76184N1900n8825J9519L4850N740K2810n1165m5617L9411N7307n3123p6301
7303c29678O1677O7950o5014L9826j3307n5016N3841J1135K978K74J6605p0838
7291b79567K4247L1907j099o0673J1067q529J08123o7211J4118J18039k17969
$$ plain form
7280 -327547 -246303 -183072 -212493 -229190 -318625 -218667 -221074 -311165 -238366 -167153 -262530 -239552
7268 -239552 -297608 -235325 -333323 -240595 -256790 -276008 -325350 -266425 -309047 -248144 -259134 -201857
7256 -201857 -303060 -297200 -297431 -258557 -227700 -303791 -342301 -202566 -268725 -253982 -283887 -371026
7244 -371026 -325998 -349341 -265603 -298473 -288821 -320092 -282184 -259797 -345956 -257140 -313767 -371697
7232 -371697 -383076 -347381 -341163 -212697 -164775 -321947 -225659 -285730 -322523 -228955 -299794
7221 -299794 -253513 -254234 -245770 -255331 -361395 -269048 -231401 -226485 -237749 -259790 -281608 -180570
7209 -180570 -253198 -251192 -332082 -242108 -275572 -302744 -262919 -337033 -322666 -312950 -241937 -324893
7197 -324893 -332688 -314322 -349367 -313606 -256174 -367382 -268156 -319717 -299595 -321283 -346442 -291594
$$ packed form
7280c27547Q1244O3231k9421j6697q9435R9958k407r0091P2799P1213r5377K2978
7268b39552n8056O2283r7998R2728j6195j9218m9342N8925m2622O0903j0990N7277
7256b01857j01203N860k31L8874L0857p6091l8510J39735o6159J4743k9905q7139
7244c71026M5028k3343Q3738l2870R652l1271L7908K2387q6159Q8816n6627n7930
7232c71697j1379L5695O218J28466M7922j57172R6288o0071l6793R3568p0839
7221b99794M6281p21Q464r561j06064R2347L7647M916j1264k2041k1818J01038
7209a80570p2628K006q0890Q9974l3464k7172L9825p4114J4367R716P1013q2956
7197c24893p795J8366l5045L5761N7432j11208R9226n1561K0122k1688k5159N4848
$$ plain form
7185 -291594 -268359 -275654 -315379 -337868 -286012 -246521 -370187 -281425 -244799 -301858 -272625 -328137
7173 -328137 -255432 -291507 -224225 -269878 -253983 -277475 -297609 -336683 -228143 -265761 -303919
7162 -303919 -282987 -206485 -256651 -297170 -207436 -362273 -225257 -234018 -254463 -295644 -210456
7151 -210456 -273236 -232836 -214118 -291751 -232128 -315182 -276480 -241273 -236561 -310417 -315449 -235536
7139 -235536 -229432 -258877 -194762 -279665 -234542 -205449 -188749 -214695 -247296 -301729 -229716 -284973
7127 -284973 -240050 -242500 -207641 -308221 -317419 -261203 -322165 -336550 -315990 -292248 -219189 -228170
7115 -228170 -275872 -244232 -257703 -271940 -272058 -144607 -274453 -303705 -238308 -222993 -204661 -212434
7103 -212434 -211248 -259237 -283398 -209896 -288202 -181479 -228556 -242532 -164616 -264259 -240712 -217213
$$ packed form
7185b91594K3235p295l9725k2489N1856L9491j23666Q8762L6626n7059K9233n5512
7173c28137P2705l6075O7282m5653J5895k3492k0134l9074J08540l7618l8158
7162c03919K0932P6502n0166m0519Q9734j54837J37016q761k0445m1181Q5188
7151b10456o2780M0400J8718p7633N9623q3054L8702L5207M712p3856n032P9913
7139b35536O104k9445O4115q4903M5123K9093J6700k5946l2601n4433P2013n5257
7127b84973M4923k450L4859j00580r198N6216o0962j4385K0560K3742P3059q981
7115b28170m7702L1640j3471j4237j18J27451j29846k9252O5397J5315J8332p773
7103b12434J186m7989k4161P3502p8306J06723m7077j3976P7916r9643K3547K3499
$$ plain form
7091 -217213 -216644 -190279 -194191 -207119 -268050 -165592 -208403 -199138 -229664 -175831 -274488 -216307
7079 -216307 -180547 -200272 -213172 -225607 -147578 -220867 -259456 -146090 -196637 -310364 -196602
7068 -196602 -193984 -146417 -214031 -235292 -203218 -150378 -197711 -171783 -134056 -272744 -161372
7057 -161372 -228886 -259575 -256003 -243509 -199316 -195588 -220245 -236244 -242064 -192700 -149221 -231319
7045 -231319 -159173 -187506 -124968 -98584 -121978 -174840 -90492 -164380 -194636 -236092 -140795 -158181
7033 -158181 -106558 -178958 -207752 -183579 -194086 -198732 -163289 -204733 -157707 -93423 -201372 -147156
7021 -147156 -197499 -226591 -198543 -161095 -175694 -199799 -232713 -200486 -251446 -122328 -196936
7010 -196936 -194109 -260162 -166224 -284306 -141629 -195080 -127552 -338036 -174092 -241961 -207678
$$ packed form
7091b17213N69K6365l912j2928o0931J02458m2811R265l0526N3833r8657N8181
7079b16307L5760j9725j2900j2435P8029p3289l8589J13366n0547j13727J13762
7068a96602K618M7567o7614k1261L2074N2840m7333K5928L7727j38688J11372
7057a61372o7514l0689L572J2494M4193L728k4657j5999n820M9364M3479q2098
7045b31319P2146k8333O2538K6384k3394n2862Q4348p3888l0256m1456R5297j7386
7033a58181N1623p2400k8794K4173j0507m646L5443m1444M7026O4284j07949N4216
7021a47156n0343k9092K8048L7448j4599k4105l2914L2227n0960J29118p4608
7010a96936K827o6053R3938j18082J42677n3451O7528k10484J63944o7869L4283
$$ plain form
6999 -207678 -210573 -148578 -229086 -264847 -133208 -263608 -178612 -252786 -170501 -142903 -231446
6988 -231446 -245551 -148137 -154774 -174274 -160559 -174647 -260199 -130579 -255887 -207231 -214877 -161473
6976 -161473 -205333 -125384 -202398 -191919 -201720 -176645 -224925 -135008 -125648 -140686 -195432 -132280
6964 -132280 -135455 -197398 -171071 -85956 -171941 -217039 -213742 -193447 -112333 -196241 -229320 -127376
6952 -127376 -136175 -184161 -216178 -207870 -186903 -212926 -90844 -191880 -180954 -158402 -93705 -156621
6940 -156621 -171957 -182160 -225217 -172800 -117502 -161518 -148059 -104313 -177069 -75624 -144452
6929 -144452 -139594 -85772 -80922 -80637 -159055 -53472 -191918 -176218 -95930 -259243 -107496 -192668
6917 -192668 -58778 -91045 -127532 -177423 -106605 -49138 -93196 -109629 -156312 -184579 -78701
$$ packed form
6999b07678k895O1995q0508l5761J31639j30400Q4996p4174Q2285K7598q8543
6988b31446j4105R7414o637j9500J3715j4088q5552J29620j25308M8656p646N3404
6976a61473m3860P9949p7014J0479r801K5075m8280Q9917R360j5038n4746O3152
6964a32280l175o1943K6327Q5115q5985m5098L297K0295Q1114q3908l3079J01944
6952a27376q799m7986l2017Q308K0967k6023J22082j01036J0926K2552O4697o2916
6940a56621j5336j0203m3057N2417N5298m4016J3459M3746p2756J01445o8828
6929a44452M858N3822M850K85p8418J05583j38446J5700Q0288j63313J51747q5172
6917a92668J33890l2267l6487m9891P0818N7467m4058j6433m6683k8267J05878
$$ plain form
6906 -78701 -28201 -115826 -53417 -123188 -48211 -119315 -19856 -27929 -106561 -45180 -27376 -27731
6894 -27731 -93972 -97592 -130865 -135358 -32830 -3632 6008 13193 -54223 -45703 -96730 -38949 -80380
6881 -80380 -102039 -70071 -101275 8129 11454 -25743 -123076 77542 -63185 4399 -97146
6870 -97146 -47144 -43015 -11034 43015 -32734 -67971 -17302 41154 -128873 -29342 2568 -42424
6858 -42424 -33885 -45549 -19256 -109090 -16754 -65925 -62738 -22672 -52558 -54858 -89395 -156737
6846 -156737 -44702 -30468 -30582 -32788 -55460 -19646 -105775 -103276 -117183 -82117 -111415 -212853
6834 -212853 -98651 -141465 -89505 -103432 -102777 -172205 -64873 -119218 -133032 -120986 -161516 -46551
6822 -46551 -60014 -138649 -99633 -75758 -172701 3269 -134201 -107949 -164086 -98323 -168246
$$ packed form
6906g8701N0500q7625O2409o9771P4977p1104R9459q073p8632O1381J7804l55
6894b7731o6241l620l3273m493J02528K9198R640P185o7416Q520n1027N7781m1431
6881h0380k1659L1968l1204J09404L325l7197r7333K00618j40727O7584j01545
6870i7146N0002M129L1981N4049p5749l5237N0669N8456j70027R9531L1910m4992
6858d2424Q539j1664K6293q9834R2336m9171L187M0066k9886k300l4537o7342
6846a56737J12035J4234j14k206k2672L5814q6129K499j3907L5066k9298j01438
6834b12853J14202m2814N1960j3927O55o9428J07332n4345j3814J2046m0530J14965
6822d6551j3463p8635L9016K3875r6943J75970j37470K6252n6137O5763o9923
$$ plain form
6811 -168246 -188357 -170252 -183846 -105500 -44105 -158173 -123136 -144602 -58185 -186209 -91393
6800 -91393 -122407 -73641 -158510 -195915 -158298 -158443 -159367 -178906 -148582 -150595 -113714 -80497 -115406
6787 -115406 -154045 -147742 -116497 -213113 -201183 -172471 -211139 -118090 -192261 -110967 -89893 -103747
6775 -103747 -154586 -174548 -137256 -104151 -124243 -154691 -93525 -73749 -103622 -113227 -233430 -76164
6763 -76164 -207803 -128265 -128526 -103478 -164074 -99433 -148664 -82795 -156721 -145200 -91217 -99807
6751 -99807 -82181 -130441 -122080 -229293 -128132 -109902 -109918 -83143 -160077 -85069 -85988 -112040 -89822
6738 -89822 -50385 -30922 -57504 -72009 -88301 -81625 -127778 35602 -89398 65690 27168
6727 27168 133520 69760 108118 67103 18870 -85666 -22634 -67950 -57384 -47690 -19204 -34222
$$ packed form
6811a68246k0111J8105j3594P8346O1395j14068L5037k1466Q6417j28024R4816
6800i1393l1014M8766q4869l7405L7617j45r24j9539L0324k013L6881L3217l4909
6787a15406l8639O303L1245r6616J1930K8712l8668R3049p4171Q1294K1074j3854
6775a03747n0839j9962L7292L3105k0092l0448O1166J9776k9873r605j20203J57266
6763g6164j31639P9538k61K5048o0596O4641m9231O5869p3926J1521N3983q590
6751i9807J7626m8260Q361j07213J01161J8230j6K6775p6934P5008r19k6052K2218
6738h9822L9437J9463k6582j4505j6292O676m6153J63380j25000J55088l8522
6727B7168J06352o3760L8358m1015m8233j04536O3032m5316J0566R694K8486j5018
$$ plain form
6715 -34222 -24039 -47385 -65053 6464 -17669 23785 -26501 33045 -20493 -41867 13177 59159
6703 59159 147842 168090 126075 253234 333659 212237 221510 74774 144711 36776 -14426
6692 -14426 27565 -33133 -103460 46227 -8573 -58501 78309 151549 25374 72853 -13449
6681 -13449 57168 19339 -3215 -54941 -89150 110761 72853 125256 73490 148676 161440 160664
6669 160664 67273 81010 48943 44254 37263 -44193 79434 14064 -4181 -42157 8165 -12149
6657 -12149 878 -37021 59351 8920 97536 21761 21105 -28566 126721 93890 81350 54578
6645 54578 101130 46237 21488 80356 -16269 58296 63586 47376 101814 57332 27385 100651
6633 100651 20018 -6293 67476 43328 81600 53842 38108 85636 85375 118921 169609 159028
$$ packed form
6715c4222J0183k3346j7668P1517k4133M1454n0286N9546n3538k1374N5044M5982
6703E9159Q8683K0248m2015J27159Q0425j21422R273j46736O9937j07935n1202
6692a4426M1991o0698p0327J49687n4800m9928J36810P3240j26175M7479q6302
6681a3449P0617l7829k2554n1726l4209J99911l7908N2403n1766P5186J2764p76
6669A60664r3391J3737l2067m689o991q1456J23627o5370j8245l7976N0322k0314
6657a2149J3027l7899R6372n0431Q8616p5775o56m9671J55287l2831j2540k6772
6645E4578M6552n4893k4749N8868r6625P4565N290j6210N4438m4482k9947P3266
6633A00651q0633k6311P3769k4148L8272k7758j5734M7528k61L3546N0688j0581
$$ plain form
6621 159028 142846 158943 146190 190431 123661 86562 110528 17756 19005 77939 138552 101308
6609 101308 138189 174651 22247 110825 103607 85059 122164 57893 64458 82947 126050 142604
6597 142604 211982 151016 141056 209443 203923 198965 176237 221450 200935 197522 243483 179068
6585 179068 286923 335043 308867 342941 213062 273789 339986 311110 240255 222896 144149
6574 144149 279652 262176 332344 290266 238744 217338 242983 281195 296208 263454 297439
6563 297439 252757 264365 287241 290531 267994 348366 397767 396731 441409 432327 397271 413959
6551 413959 327528 308892 388459 341350 349967 212405 329266 264885 152557 240439 227625
6540 227625 213571 302782 315042 278281 333706 292268 299736 242278 272755 204814 211844 279798
$$ packed form
6621A59028j6182J6097j2753M4241o6770l7099K3966r2772J249N8934O0613l7244
6609A01308L6881L6462j52404Q8578p218j8548L7105o4271O565J8489M3103J6554
6597A42604O9378o0966r960O8387n520m958k2728M5213k0515l413M5961o4415
6585A79068J07855M8120k6176L4074j29879O0727O6197k8876p0855j7359p8747
6574A44149J35503j7476P0168m2078n1522k1406K5645L8212J5013l2754L3985
6563B97439m4682J1608K2876L290k2537Q0372M9401j036M4678r082l5056J6688
6551D13959q6431j8636P9567m7109Q617j37562J16861o4381j12328Q7882j2814
6540B27625j4054Q9211J2260l6761N5425m1438P468n7458L0477o7941P030O7954
$$ plain form
6528 279798 293382 292232 310576 227704 337617 279274 317543 242736 263582 277628 229797 268918
6516 268918 251080 322532 193483 241256 170271 193056 182106 215758 169652 171586 151499 177344
6504 177344 210620 146736 201352 176301 178539 121058 161510 183389 152222 212134 202580 183786
6492 183786 210559 178278 160904 230991 180460 147243 216645 181776 142994 152300 130033 100132
6480 100132 142464 130290 148499 165541 293298 117804 144399 159528 90769 242795 155283
6469 155283 179088 137002 94852 185260 124697 144025 237095 153827 184933 242335 304957 212075
6457 212075 202220 254257 282276 115456 231119 239293 163983 186882 181161 192840 200163 204741
6445 204741 153208 160508 231047 228495 180709 111942 71238 112982 144407 165801 225933 132827
$$ packed form
6528B79798J3584j150J8344q2872J09913n8343L8269p4807K0846J4046m7831L9121
6516B68918j7838P1452j29049M7773p0985K2785j0950L3652m6106J934k0087K5845
6504A77344L3276o3884N4616k5051K238n7481M0452K1879l1167N9912r554j8794
6492A83786K6773l2281j7374P0087n0531l3217O9402l4869l8782R306k2267k9901
6480A00132M2332j2174J8209J7042J27757j75494K6595J5129o8759J52026q7512
6469A55283K3805m2086m2150R0408o0563J9328R3070q3268L1106N7402O2622r2882
6457B12075r855N2037K8019j66820J15663Q174p5310K2899n721J1679P323M578
6445B04741n1533P300P0539k552m7786o8767m0704M1744L1425K1394O0132r3106
$$ plain form
6433 132827 120983 157747 208409 12808 142502 15520 73126 54782 89759 99773 113005
6422 113005 121085 136217 75773 75456 84761 135295 139949 32013 31282 113728 49839 108711 103847
6409 103847 117560 86179 95385 66547 157853 113787 22447 74638 115190 74583 62325 117456
6397 117456 117129 121820 106563 77278 128564 73323 150331 97675 128938 95264 127768 158138
6385 158138 69961 133895 121202 30816 87046 99220 36855 196662 121616 125503 180225 122411
6373 122411 171566 114752 93531 128155 152497 196208 149016 150225 56476 93250 134621 58097
6361 58097 193781 143873 53587 78461 158108 117658 155136 96253 180209 228140 126149
6350 126149 78746 132253 172082 129213 152437 120602 140295 97581 189013 113268 177680 188894
$$ packed form
6433A32827j1844L6764N0662j95601J29694j26982N7606j8344L4977J0014J3232
6422A13005Q080J5132o0444l17R305N0534M654j07936p31Q2446o3889N8872m864
6409A03847J3713l1381R206k8838R1306m4066r1340N2191M0552m0607j2258N5131
6397A17456l27M691j5257k9285N1286n5241P7008n2656L1263l3674L2504L0370
6385A58138q8177O3934j2693r0386N6230J2174o2365J59807p5046L887N4722n7814
6373A22411M9155n6814k1221L4624K4342M3711m7192J209r3749L6774M1371p6524
6361E8097J35684m9908r0286K4874P9647m0450L7478n8883Q3956M7931j01991
6350A26149m7403N3507L9829m2869K3224l1835J9693m2714R1432p5745O4412J1214
$$ plain form
6338 188894 123272 122311 99579 56878 128328 169508 148094 57008 118901 111473 54214 114021
6326 114021 86312 -19389 65739 82033 165662 138638 125167 186029 105300 94933 80306
6315 80306 189546 129315 119822 142891 128114 136872 251836 207663 162969 106010 203910 152584
6303 152584 147496 217114 137172 125170 137830 162879 169754 259243 195311 189540 229078 214340
6291 214340 182799 209131 208845 122979 158003 209228 169059 192156 251887 161205 207131 175559
6279 175559 229135 259376 208787 259792 228078 229246 325881 276853 246210 160608 264036 180781
6267 180781 220286 234444 190528 293684 206809 228572 295895 252883 187805 211220 311114
6256 311114 251570 191498 156725 200007 242736 305988 311860 240507 196144 173746 245162 251742
$$ packed form
6338A88894o5622r61k2732m2701P1450M1180k1414r1086O1893p428n7259N9807
6326A14021k7709j05701Q5128J6294Q3629k7024j3471O0862q0729j0367j4627
6315H0306J09240o0231r493K3069j4777Q758J14964m4173m4694n6959R7900n1326
6303A52584n088O9618p9942j2002J2660K5049O875Q9489o3932n771L9538j4738
6291B14340l1541K6332k86q5866L5024N1225m0169K3097N9731r0682M5926l1572
6279A75559N3576L0241n0589N1005l1714J168R6635m9028l0643q5602J03428q3255
6267A80781L9505J4158m3916J03156q6875K1763O7323m3012o5078K3415R9894
6256C11114n9544o0072l4773M3282M2729O3252N872p1353m4363k2398P1416O580
$$ plain form
6244 251742 199930 193666 197205 189093 180742 160569 220831 268358 182599 187822 239898 245586 315269
6231 315269 287403 319202 337811 375039 289134 436360 296580 390378 380045 438286 331034
6220 331034 323627 388657 402662 306185 367690 371422 312730 339621 344521 281083 374155 251809
6208 251809 331217 266047 241703 276141 206948 249317 206870 212724 286739 174601 259031 214924
6196 214924 254517 249348 200072 241248 241372 181216 191577 224500 297672 213675 230562 242043
6184 242043 279579 329217 235143 267359 276118 255784 340014 319375 283679 363312 396082 341765
6172 341765 344338 305378 315100 362627 371695 306767 323584 429227 347783 326922 330981 295239
6160 295239 332630 316860 332986 354499 352282 212469 328258 329384 274254 324808 378024 339702
$$ packed form
6244B51742n1812o264L539q112q351k0173O0262M7527q5759N223N2076N688O9683
6231C15269k7866L1799J8609L7228q5905J47226j39780R3798j0333N8241j07252
6220C31034p407O5030J4005r6477O1505L732n8692K6891M900o3438R3072j22346
6208B51809P9408o5170k4344L4438o9193M2369m2447N854P4015j12138Q4430m4107
6196B14924L9593n169m9276M1176J24o0156J0361L2923P3172q3997J6887J1481
6184B42043L7536M9638r4074L2216Q759k0334Q4230k0639l5696P9633L2770n4317
6172C41765K573l8960R722M7527R068o4928J6817J05643q1444k0861M059l5742
6160B95239L7391j5770J6126K1513k217j39813J15789J126n5130N0554N3216l8322
$$ plain form
6148 339702 364628 396615 416371 487031 359035 369631 383517 309681 474321 402176 519230
6137 519230 442089 434500 433624 457900 447889 478810 427328 516213 499374 508118 526350 610901
6125 610901 569506 431752 484690 509691 498018 426332 521243 440249 468738 392923 477739
6114 477739 443153 413904 494853 442686 416950 398408 456904 441116 538551 436735 495930
6103 495930 440468 400436 375765 469833 502951 451325 434598 529704 459134 449827 516036 466324
6091 466324 404145 459112 424798 413825 511241 489764 457224 444235 479711 496554 445228 562666
6079 562666 529390 527560 565983 506431 534712 522075 529859 541018 492786 572868 466038 491984
6067 491984 435720 596292 545874 560875 522740 492393 534302 523119 548854 570297 545102
$$ packed form
6148C39702K4926L1987J9756P0660j27996J0596J3886p3836J64640p2145J17054
6137E19230p7141p589q76K4276j0011L0921n1482Q8885j6839Q744J8232Q4551
6125F10901m1395j37754N2938K5001j1673p1686R4911q0994K8489p5815Q4816
6114D77739l4586k9249Q0949n2167k5736j8542N8496j5788R7435j01816N9195
6103D95930n5462m0032k4671R4068L3118n1626j6727R5106p0570r307O6209m9712
6091D66324o2179N4967l4314j0973R7416k1477l2540j2989L5476J6843n1326J17438
6079E62666l3276j830L8423n9552K8281j2637P784J1159m8232Q0082j06830K5946
6067D91984n6264J60572n0418J5001l8135l0347M1909j1183K5735K1443k5195
$$ plain form
6056 545102 533331 514853 511779 596192 483271 550725 510688 531606 571624 551655 639304 544175
6044 544175 651097 608489 637216 598247 593413 693894 654653 647329 621910 657287 629836 630377
6032 630377 672552 697796 682811 658502 698334 629293 706042 741327 777250 788856 804835 851034
6020 851034 842704 805126 905614 945771 913195 1028280 1017869 1155725 1071639 1095431 1259189
6009 1259189 1118446 1184557 1173602 1228145 1191282 1261576 1168191 1171431 1039783 1207869 1080712
5998 1080712 1151810 1185559 1125619 1142857 1117323 1240373 1257949 1265252 1306643 1331206 1320440
5987 1320440 1518571 1458765 1603545 1513470 1613376 1632535 1768339 1825913 1759653 1848821 1814783
5976 1814783 1817329 1871567 1794128 1739884 1729361 1742732 1737222 1553503 1612386 1549809 1483166 1454577
$$ packed form
6056E45102j1771j8478l074Q4413j12921O7454m0037K0918M0018j9969Q7649r5129
6044E44175J06922m2608K8727l8969m834J00481l9241p324k5419L5377k7451N41
6032F30377M2175K5244j4985k4309L9832o9041P6749L5285L5923J1606J5979M6199
6020H51034q330l7578J00488M0157l2576J15085j0411J37856q4086K3792J63758
6009A259189j40743O6111j0955N4543l6863P0294r3385L240j31648J68086j27157
5998A080712P1098L3749n9940J7238k5534J23050J7576P303M1391K4563j0766
5987A320440J98131n9806J44780r0075R9906J9159J35804N7574o6260Q9168l4038
5976A814783K546N4238p7439n4244j0523J3371n510j83719N8883o2577o6643k8589
$$ plain form
5964 1454577 1451768 1542289 1515486 1517695 1541655 1540105 1564616 1576589 1656341 1615206 1683166 1687959
5952 1687959 1718705 1803413 1700627 1795104 1814040 1925571 1865055 1767145 1801966 1825876 1814903
5941 1814903 1684982 1684774 1706461 1657205 1749280 1708956 1679410 1694228 1695321 1701443 1678980 1702296
5929 1702296 1705516 1690899 1676337 1656572 1759115 1735612 1788158 1817066 1861456 1833353 1871120
5918 1871120 1936622 1960349 1965357 2016260 2058766 2060589 2063388 2129416 2204491 2139097 2134562 2214467
5906 2214467 2192018 2272946 2333566 2338938 2378012 2482391 2427148 2463268 2529041 2552147 2645938
5895 2645938 2606409 2683516 2695249 2689986 2779393 2845619 2875893 2864670 2971213 2994469 3152318
5884 3152318 3131652 3199575 3210571 3257024 3418234 3438629 3474958 3487058 3641844 3720362 3718561
$$ packed form
5964A454577k809R0521k6803K209K3960j550K4511J1973P9752m1135O7960M793
5952A687959L0746Q4708j02786R4477J8936J11531o0516r7910L4821K3910j0973
5941A814903j29921k08K1687m9256R2075m0324k9546J4818J093O122k2463K3316
5929A702296L220j4617j4562j9765J02543k3503N2546K8908M4390k8103L7767
5918A871120O5502K3727N008N0903M2506J823K799O6028P5075o5394m535P9905
5906B214467k2449Q0928O0620N372L9074J04379n5243L6120O5773K3106R3791
5895B645938l9529P7107J1733n263Q9407O6226L0274j1223J06543K3256J57849
5884C152318k0666O7923J0996M6453J61210K0395L6329J2100J54786P8518j801
$$ plain form
5873 3718561 3837612 3845532 3870730 3913064 3941771 4029228 4072019 4055189 4131908 4266941 4199715
5862 4199715 4296168 4374364 4438348 4541956 4603167 4675669 4825316 4884912 4971264 5049831 5090408
5851 5090408 5305047 5339434 5411453 5507566 5645871 5814399 5850290 5884636 6072642 6032497 6097479
5840 6097479 6161049 6168741 6299544 6366419 6368702 6497652 6427998 6569528 6578478 6714837 6784402
5829 6784402 6989746 7056744 7276301 7419794 7600990 7817171 7970948 8132722 8308233 8557520
5819 8557520 8598219 8978050 9084951 9233566 9363569 9533455 9694376 9671799 9770363 9967140
5809 9967140 9969528 10097664 10212811 10365222 10514163 10575657 10738843 10882604 11093436 11294816
5799 11294816 11488647 11710980 12035421 12255339 12641181 12954769 13362273 13751696 14202286
$$ packed form
5873C718561J19051P920K5198M2334K8707Q7457M2791j6830P6719J35033o7226
5862D199715R6453P8196O3984J03608O1211P2502J49647N9596Q6352P8567M0577
5851E090408K14639L4387P2019R6113J38305J68528L5891L4346J88006m0145O4982
5840F097479O3570P692J30803O6875K283J28950o9654J41530Q950J36359O9565
5829F784402K05344O6998K19557J43493J81196K16181J53777J61774J75511K49287
5819H557520M0699L79831J06901J48615J30003J69886J60921k2577R8564J96777
5809I967140K388J28136J15147J52411J48941O1494J63186J43761K10832K01380
5799A1294816J93831K22333L24441K19918L85842L13588M07504L89423M50590
$$ plain form
5790 14202286 14647176 14959349 15494068 15928735 16343382 16721177 17133429 17499973 17925848
5781 17925848 18241622 18683669 19065628 19407812 19887420 20299514 20876992 21446075 22018591
5772 22018591 22649977 23418451 24128636 25071646 26123109 27071169 28141755 29460239 30867715
5763 30867715 32444290 34224488 36298317 38614877 41288732 44431324 47988042 52101100
5755 52101100 56771815 62033403 67982491 74447796 81103576 87878913 93957309 99119771
5747 99119771 102750182 104617176 104494925 102764258 99703196 95782382 91389294 87242051
5739 87242051 83075403 79597282 76761013 74558426 73178665 72451093 72451738 73221299 74577849
5730 74577849 76749195 79888130 83980316 89054682 95404416 103088292 112357271 122877333
$$ packed form
5790A4202286M44890L12173N34719M34667M14647L77795M12252L66544M25875
5781A7925848L15774M42047L81959L42184M79608M12094N77478N69083N72516
5772B2018591O31386P68474P10185R43010J051463R48060J070586J318484J407476
5763C0867715J576575J780198K073829K316560K673855L142592L556718M113058
5755E2101100M670715N261588N949088O465305O655780O775337O078396N162462
5747I9119771L630411J866994j22251j730667l061062l920814m393088m147243
5739H7242051m166648l478121k836269k202587j379761p27572O45P69561J356550
5730G4577849K171346L138935M092186N074366O349734P683876R268979J0520062
$$ plain form
5722 122877333 134570589 146807171 158906272 169588921 178323048 183955170 186303762
5715 186303762 185532097 181401073 174752346 165827891 155460978 144100613 132409388 121325522
5707 121325522 110993257 101844235 94197902 88003357 83165613 79668890 77251825 75872635
5699 75872635 75486514 75770425 76895709 78629820 81248037 84382551 88174269 92771657
5691 92771657 98089395 103542247 109290853 114323936 118530101 121077046 121522497 119773646
5683 119773646 115816516 110041662 102901063 95259824 87508817 80055158 73308921 67462180
5675 67462180 62377832 58097936 54503835 51576208 49141425 47158823 45541331 44374728
5667 44374728 43247799 42445081 41769360 41345276 40991540 40721399 40434025 40356197 40365073 40200691
$$ packed form
5722A22877333J1693256J2236582J2099101J0682649Q734127N632122K348592
5715A86303762p71665m131024o648727q924455j0366913j1360365j1691225j1083866
5707A21325522j0332265r149022p646333o194545m837744l496723k417065j379190
5699G5872635l86121K83911J125284J734111K618217L134514L791718M597388
5691I2771657N317738N452852N748606N033083M206165K546945M45451j748851
5683A19773646l957130n774854p140599p641239p751007p453659o746237n846741
5675F7462180n084348m279896l594101k927627k434783j982602j617492j166603
5667D4374728j126929q02718o75721m24084l53736k70141k87374p7828Q876j64382
$$ plain form
5657 40200691 40240346 40164898 40332393 40401391 40600378 40740293 41028190 41243483 41638058 42174519
5647 42174519 42643968 43202302 43985015 44775727 45682758 46717587 47911239 49246626 50695015
5638 50695015 52289726 54029753 56006195 58206507 60579048 63148741 65876585 68662495
5630 68662495 71658194 74623617 77792480 80901434 84079616 87358060 90584361 93850166
5622 93850166 97362297 100884549 104523128 108187586 111870919 115686164 119176745 122764411
5614 122764411 125963894 128864549 131482195 133765865 135725377 137680693 139553276 141577415
5606 141577415 143890747 146612027 150168309 154147613 159051521 164503808 170788704 177451211
5598 177451211 184515056 191713346 198939473 205837641 212114152 217604622 222045394 225269352
$$ packed form
5657D0200691L9655p5448J67495O8998J98987J39915K87897K15293L94575N36461
5647D2174519M69449N58334P82713P90712R07031J034829J193652J335387J448389
5638E0695015J594711J740027J976442K200312K372541K569693K727844K785910
5630F8662495K995699K965423L168863L108954L178182L278444L226301L265805
5622I3850166L512131L522252L638579L664458L683333L815245L490581L587666
5614A22764411L199483K900655K617646K283670J959512J955316J872583K024139
5606A41577415K313332K721280L556282L979304M903908N452287O284896O662507
5598A77451211P063845P198290P226127O898168O276511N490470M440772L223958
$$ plain form
5590 225269352 227177723 227639172 226607422 224357461 221001118 216758638 212080973 207033720
5582 207033720 201981558 197199338 192676079 188671772 185270330 182400649 180032838 178602139
5574 178602139 177690997 177191606 177296323 177624723 178156957 178770692 179312020 179504582 179524018
5565 179524018 178883979 178114250 177137507 176289677 175727729 175543423 175961451 176681985 177762898
5556 177762898 178926161 179825016 179933562 179033813 177017071 173881490 169719453 164869830
5548 164869830 159660526 154565733 149569418 145189363 141508942 138645243 136646692 135863675
5540 135863675 135821914 136686457 138548046 141297262 144906250 149536861 155079521 161633120
5532 161633120 169361116 177692824 186604092 195702613 204443137 212132237 218123757 222087939
$$ packed form
5590B25269352J908371M61449j031750k249961l356343m242480m677665n047253
5582B07033720n052162m782220m523259m004307l401442k869681k367811j430699
5574A78602139r11142m99391J04717L28400N32234O13735N41328J92562J9436
5565A79524018o40039p69729r76743q47830n61948j84306M18028P20534J080913
5556A77762898J163263Q98855J08546q99749k016742l135581m162037m849623
5548A64869830n209304n094793m996315m380055l680421k863699j998551p83017
5540A35863675m1761Q64543J861589K749216L608988M630611N542660O553599
5532A61633120P727996Q331708Q911268R098521Q740524P689100N991520L964182
$$ plain form
5524 222087939 223753240 222705167 219434796 213833999 206638827 198261075 189158751 180055654
5516 180055654 171227855 163081864 155870375 149592026 144232252 139834580 136423424 133962074
5508 133962074 132080564 130910079 130510639 130762140 131744318 133476858 136008486 139186200
5500 139186200 142945210 146941944 150888652 154130616 156245761 156971017 155705402 152624706
5492 152624706 147945824 141766802 134602409 126921050 119219960 111791160 104756911 98498161
5484 98498161 92795584 87868431 83431078 79542488 76181325 73087831 70352414 67893793
5476 67893793 65530069 63394087 61459432 59590045 57774785 56120327 54581626 53166135
5468 53166135 51972071 50720903 49789641 48807981 47868333 47113461 46375733 45585161 44856754
$$ packed form
5524B22087939J665301j048073l270371n600797p195172q377752r102324r103097
5516A80055654q827799q145991p211489o278349n359774m397672l411156k461350
5508A33962074j881510j170485l99440K51501R82178J732540K531628L177714
5500A39186200L759010L996734L946708L241964K115145P25256j265615l080696
5492A52624706m678882o179022p164393p681359p701090p428800p034249o258750
5484I8498161n702577m927153m437353l888590l361163l093494k735417k458621
5476F7893793k363724k135982j934655j869387j815260j654458j538701j415491
5468E3166135j194064j251168r31262r81660r39648p54872p37728p90572p28407
$$ plain form
5459 44856754 44204015 43513674 42729245 42038535 41340598 40600214 39716661 38921000 38028203
5450 38028203 37202230 36396614 35554100 34776796 33953709 33331690 32640637 32003641 31376300
5441 31376300 30853139 30453753 29996035 29700123 29297227 29016102 28826132 28681496 28596633 28531823
5431 28531823 28321441 28225327 28135715 28107577 27903636 27743193 27589539 27444082 27281193 27053593
5421 27053593 27024149 26792127 26752761 26796424 26745550 26807024 26904290 27182203 27387009 27650433
5411 27650433 27985371 28269666 28617963 29019291 29379174 29713957 30014122 30206089 30435044
5402 30435044 30363414 30462497 30345085 30247162 29984703 29809485 29629932 29539365 29310587 29242036
5392 29242036 29254205 29379868 29520839 29739241 30035938 30352020 30835087 31289152 31813971 32177736
$$ packed form
5459D4856754o52739o90341p84429o90710o97937p40384q83553p95661q92797
5450C8028203q25973q05616q42514p77304q23087o22019o91053o36996o27341
5441C1376300n23161l99386m57718k95912m02896k81125j89970j44636q4863o4810
5431B8531823k10382r6114q9612k8138k03941j60443j53654j45457j62889k27600
5421B7053593k9444k32022l9366M3663n0874O1474R7266K77913K04806K63424
5411B7650433L34938K84295L48297M01328L59883L34783L00165J91967K28955
5402C0435044p1630R9083j17412r7923k62459j75218j79553r0567k28778o8551
5392B9242036J2169J25663J40971K18402K96697L16082M83067M54065N24819L63765
$$ plain form
5382 32177736 32742677 33224796 33630964 33890439 34119989 34167519 34194255 34149441 33966804 33799939
5372 33799939 33532703 33348963 33189377 32918868 32904147 32946672 32969500 33155557 33296154 33456507
5362 33456507 33702199 33928532 34222997 34432262 34731064 34964253 35137152 35211138 35317921 35204365
5352 35204365 35068215 34920309 34557803 34020513 33590073 32937564 32436875 31870936 31327296
5343 31327296 30883921 30376808 30004445 29592777 29230017 28830014 28681644 28385182 28200873
5334 28200873 27926212 27630774 27451020 27154228 26841651 26571550 26189237 25826355 25331054
5325 25331054 25006046 24792568 24439131 24228832 24085473 23877567 23828828 23560918 23422016 23257940
5315 23257940 23189643 23161041 23159131 23156854 23103621 23189571 23340438 23454258 23731478 23800279 24110868
$$ packed form
5382C2177736N64941M82119M06168K59475K29550M7530K6736m4814j82637j66865
5372C3799939k67236j83740j59586k70509j4721M2525K2828J86057J40597J60353
5362C3456507K45692K26333K94465K09265K98802K33189J72899P3986J06783j13556
5352C5204365j36150j47906l62506n37290m30440o52509n00689n65939n43640
5343C1327296m43375n07113l72363m11668l62760m00003j48370k96462j84309
5334B8200873k74661k95438j79754k96792l12577k70101l82313l62882m95301
5325B5331054l25008k13478l53437k10299j43359k07906m8739k67910j38902j64076
5315B3257940o8297k8602j910k277n3233Q5950J50867J13820K77220O8801L10589
$$ plain form
5304 24110868 24364045 24601691 24972596 25211825 25606320 26014321 26328302 26703336 27050963
5295 27050963 27397140 27922333 28238532 28643948 29107286 29399986 29950262 30467888 30959087
5286 30959087 31469816 32019346 32565949 33367605 34075560 34765332 35763682 36656106 37734544
5277 37734544 38812811 40106871 41375312 42847051 44351762 45955579 47801937 49745533
5269 49745533 51919640 54175030 56610462 59389597 62517086 65876771 69572972 73436066
5261 73436066 77580151 81702318 86121756 90475530 94552303 98582468 102274013 105610874
5253 105610874 108584586 111311528 113627830 115646617 117542703 119454701 121123678 123119172
5245 123119172 125283161 127892717 130732573 134043275 137920298 142301279 147033578 151894617
$$ packed form
5304B4110868K53177K37646L70905K39229L94495M08001L13981L75034L47627
5295B7050963L46177N25193L16199M05416M63338K92700N50276N17626M91199
5286C0959087N10729N49530N46603Q01656P07955O89772R98350Q92424J078438
5277C7734544J078267J294060J268441J471739J504711J603817J846358J943596
5269D9745533K174107K255390K435432K779135L127489L359685L696201L863094
5261G3436066M144085M122167M419438M353774M076773M030165L691545L336861
5253A05610874K973712K726942K316302K018787J896086J911998J668977J995494
5245A23119172K163989K609556K839856L310702L877023M380981M732299M861039
$$ plain form
5237 151894617 157005006 161967473 166570464 170472969 173323881 174960290 175173462 173821156
5229 173821156 171111174 167060474 161899959 156061583 149647430 143058083 136566174 130509155
5221 130509155 124974249 120081442 115938087 112610535 110021167 108038158 106681998 105694670
5213 105694670 104983470 104264016 103607688 102678020 101492077 99681107 97475876 94700768 91455339
5204 91455339 87544675 83389459 79007713 74414401 69831577 65346988 61104214 57080315
5196 57080315 53565588 50094245 47155344 44447031 42065624 39849318 37898008 36232135
5188 36232135 34548172 33148486 31858563 30716119 29506210 28424771 27422010 26530058
5180 26530058 25632913 24899222 24056513 23297113 22681876 22062315 21408861 20894351 20352914
$$ packed form
5237A51894617N110389M962467M602991L902505K850912J636409K13172j352306
5229A73821156k709982m050700n160515n838376o414153o589347o491909o057019
5221A30509155n534906m892807m143355l327552k589368j983009j356160r87328
5213A05694670p11200p19454o56328r29668j185943j810970k205231k775108l245429
5204I1455339l910664m155216m381746m593312m582824m484589m242774m023899
5196E7080315l514727l471343k938901k708313k381407k216306j951310j665873
5188C6232135j683963j399686j289923j142444j209909j081439j002761q91952
5180B6530058q97145p33691q42709p59400o15237o19561o53454n14510n41437
$$ plain form
5171 20352914 19891627 19349577 18986291 18416125 18117123 17763965 17380900 16978624 16695743
5162 16695743 16362490 16062226 15708937 15431925 15214404 14920210 14727446 14488793 14211528
5153 14211528 14048444 13866140 13636346 13546779 13342228 13144228 13032215 12782475 12662851 12580908
5143 12580908 12364904 12280228 12166648 11996328 12019242 11940776 11873836 11809904 11772952 11826601 11866477
5132 11866477 11824689 11831737 11800717 11799798 11904018 11795174 11964649 11866120 11795975 11820894 11818660
5121 11818660 11749270 11750404 11732677 11879409 11846428 11925879 11984275 12049299 12145278 12204250 12301679
5110 12301679 12293841 12363044 12454341 12485557 12568754 12435428 12401950 12412839 12317581 12328812 12230892
5099 12230892 12306547 12257311 12280777 12306632 12385123 12527749 12487645 12755597 12794128 12794965 12930410
$$ packed form
5171B0352914m61287n42050l63286n70166k99002l53158l83065m02276k82881
5162A6695743l33253l00264l53289k77012k17521k94194j92764k38653k77265
5153A4211528j63084j82304k29794q9567k04551j98000j12013k49740j19624q1943
5143A2580908k16004q4676j13580j70320K2914p8466o6940o3932l6952N3649L9876
5132A1866477m1788P048l1020r19J04220j08844J69475r8529p0145K4919k234
5121A1818660o9390J134j7727J46732l2981P9451N8396O5024R5979N8972R7429
5110A2301679p838O9203R1297L1216Q3197j33326l3478J0889r5258J1231r7920
5099A2230892P5655m9236K3466K5855P8491J42626m0104K67952L8531Q37J35445
$$ plain form
5088 12930410 12970504 13091605 13149500 13244461 13379765 13457108 13518489 13605088 13592386 13605556 13561747
5077 13561747 13786286 13737611 13699787 13768304 13841463 13871468 13881293 14015540 14002339 14073659 14186365
5066 14186365 14227499 14254112 14271180 14372575 14490770 14703822 14768373 14932869 15157062 15382219
5056 15382219 15556127 15832532 15896627 16189824 16437162 16589117 16960433 17173031 17435003 17612388
5046 17612388 17747957 17893748 18073390 18304415 18370211 18443485 18763789 19038344 19248062 19644037
5036 19644037 19930139 20425012 20818873 21322953 21950946 22679024 23346112 24221903 25257687
5027 25257687 26384166 27636806 29072090 30678201 32494143 34417094 36617678 38897898
5019 38897898 41170862 43559602 45731073 47535886 48800723 49524581 49383530 48728391 47696804
$$ packed form
5088A2930410M0094J21101N7895R4961J35304P7343O1381Q6599j2702J3170m3809
5077A3561747K24539m8675l7824O8517P3159L0005R825J34247j3201P1320J12706
5066A4186365M1134K6613J7068J01395J18195K13052O4551J64496K24193K25157
5056A5382219J73908K76405O4095K93197K47338J51955L71316K12598K61972J77385
5046A7612388J35569J45791J79642K31025O5796P3274L20304K74555K09718L95975
5036A9644037K86102M94873L93861N04080O27993P28078O67088Q75791J035784
5027B5257687J126479J252640J435284J606111J815942J922951K200584K280220
5019C8897898K272964K388740K171471J804813J264837P23858j41051o55139j031587
$$ plain form
5010 47696804 46559184 45684196 45161690 44949907 45140175 45474186 46254909 47313546 48506480
5001 48506480 49931451 51446502 53297899 55671054 58413851 61746687 65614324 70180610
4993 70180610 75274200 80823885 86521201 92434046 98015735 103110049 107685230 111353464
4985 111353464 113579563 114395357 113384890 110641927 106599317 101953681 97470881 93269749
4977 93269749 89705014 86786529 84591045 83018930 81929984 81710712 81975115 82739589 84190213
4968 84190213 86409049 89582829 93545630 98428680 104144398 110439829 117165689 124024346
4960 124024346 130862729 137083018 142345643 146085835 148084399 148085203 146250447 142449006 136915109
4951 136915109 129982033 122608646 114976532 107869739 101449337 95930481 91315114 87582287
$$ packed form
5010D7696804j137620q74988n22506k11783J90268L34011P80723J058637J192934
5001D8506480J424971J515051J851397K373155K742797L332836L867637M566286
4993G0180610N093590N549685N697316N912845N581689N094314M575181L668234
4985A11353464K226099Q15794j010467k742963m042610m645636m482800m201132
4977I3269749l564735k918485k195484j572115j088946k19272K64403P64474J450624
4968H4190213K218836L173780L962801M883050N715718O295431O725860O858657
4960A24024346O838383O220289N262625L740192J998564Q04j834756l801441n533897
4951A36915109o933076p373387p632114p106793o420402n518856m615367l732827
$$ plain form
4943 87582287 84907992 82987868 81698260 81029402 80899349 80989824 81710063 82891577 84792476
4934 84792476 87465296 90884202 95182469 100015466 104899681 108847908 111642521 112660963
4926 112660963 112023887 109693395 106067499 101545202 96334388 90711415 84982323 79386715
4918 79386715 74140416 69413921 65207638 61879360 58994278 56642505 54554427 52919176
4910 52919176 51472761 50327004 49345913 48678146 48463951 48502750 48963478 49674539 50815644
4901 50815644 51946368 53165619 53914669 54503826 54608900 54395687 53648695 52557692 50913525
4892 50913525 48797489 46408350 43932137 41576087 39434700 37427611 35671498 34207435
4884 34207435 32951663 31948197 31025955 30334105 29832630 29547177 29246107 29135578 29208247
$$ packed form
4943H7582287k674295j920124j289608o68858j30053R0475P20239J181514J900899
4934H4792476K672820L418906M298267M832997M884215L948227K794613J018442
4926A12660963o37076k330492l625896m522297n210814n622973n729092n595608
4918G9386715n246299m726495m206283l328278k885082k351773k088078j635251
4910E2919176j446415j145757r81091o67767k14195L8799M60728P11061J141105
4901E0815644J130724J219251P49050N89157J05074k13213p46992j091003j644167
4892E0913525k116036k389139k476213k356050k141387k007089j756113j464063
4884C4207435j255772j003466r22242o91850n01475k85453l01070j10529P2669
$$ plain form
4875 29208247 29323005 29482699 29686351 29906628 30125946 30251856 30164579 29940567 29584359 29089095
4865 29089095 28583203 28089033 27577547 27137690 26649996 26245805 25817998 25378265 24976516
4856 24976516 24596785 24340646 23936434 23728980 23513643 23239713 23026372 22927502 22921068 22880142
4846 22880142 22900069 23014831 23167217 23342804 23376139 23482459 23558860 23450777 23333767 23200146
4836 23200146 22964031 22798854 22433622 22240503 22053321 21855820 21705025 21492787 21291477
4827 21291477 21112078 20833183 20645913 20409683 20216510 19892180 19721550 19481598 19314941
4818 19314941 19216311 19147601 18972777 19074867 18979624 18957642 19012448 18943954 19058232 19044310 19057983
4807 19057983 19147312 19091146 19107893 19118636 19115456 19168276 19275879 19264852 19281487 19330518 19390000
$$ packed form
4875B9208247J14758J59694K03652K20277K19318J25910q7277k24012l56208m95264
4865B9089095n05892m94170n11486m39857m87694m04191m27807m39733m01749
4856B4976516l79731k56139m04212k07454k15337k73930k13341r8870o434m0926
4846B2880142J9927J14762J52386J75587L3335J06320P6401j08083j17010j33621
4836B3200146k36115j65177l65232j93119j87182j97501j50795k12238k01310
4827B1291477j79399k78895j87270k36230j93173l24330j70630k39952j66657
4818A9314941r8630o8710j74824J02090r5243k1982N4806o8494J14278j3922J3673
4807A9057983Q9329n6166J6747J0743l180N2820J07603j1027J6635M9031N9482
$$ plain form
4796 19390000 19318229 19323131 19338234 19334268 19359842 19355114 19439411 19442551 19648222 19761192 19886749
4785 19886749 20124689 20256105 20606339 20797370 21064176 21432807 21803751 22094734 22465344
4776 22465344 22883236 23287429 23819324 24318954 24857068 25312136 25971176 26520839 27187505
4767 27187505 27772512 28479445 29195526 29890380 30804361 31690690 32532125 33573859 34733439
4758 34733439 35975490 37234652 38633267 40134601 41658831 43314451 44832664 46447158
4750 46447158 48112439 49580599 51115109 52696829 54160831 55618649 57233783 58755645
4742 58755645 60307663 62141528 63926811 65599852 67492046 69444700 71281332 73003298
4734 73003298 74697323 76131062 77602640 78972115 80548365 82239805 83933878 85943598
$$ packed form
4796A9390000p1771M902J5103l966K5574m728Q4297L140K05671J12970J25557
4785A9886749K37940J31416L50234J91031K66806L68631L70944K90983L70610
4776B2465344M17892M04193N31895M99630N38114M55068O59040N49663O66666
4767B7187505N85007P06933P16081O94854R13981Q86329Q41435J041734J159580
4758C4733439J242051J259162J398615J501334J524230J655620J518213J614494
4750D6447158J665281J468160J534510J581720J464002J457818J615134J521862
4742E8755645J552018J833865J785283J673041J892194J952654J836632J721966
4734G3003298J694025J433739J471578J369475J576250J691440J694073K009720
$$ plain form
4726 85943598 88070556 90410950 92960715 95690936 98820028 102131490 105704899 109525013
4718 109525013 113636235 117956363 122831062 127822535 132966726 138108471 142956069 147399295
4710 147399295 151304136 154752363 157852775 160711557 163579232 166711434 170532796 174704576
4702 174704576 179831062 185694112 192383061 199697792 207471615 215423962 223704558 232468563
4694 232468563 242189824 252300263 262669667 272447218 281111631 288199654 293634323 297468573
4686 297468573 299809134 300931867 301278053 300992274 300030984 298742622 297200787 295688738
4678 295688738 294292284 293072658 292159762 291685740 291394735 291375104 291228156 290624850 289592702
4669 289592702 288023920 285957212 282945215 278814296 272971572 265464435 256660503 246853546
$$ packed form
4726H5943598K126958K340394K549765K730221L129092L311462L573409L820114
4718A09525013M111222M320128M874699M991473N144191N141745M847598M443226
4710A47399295L904841L448227L100412K858782K867675L132202L821362M171780
4702A74704576N126486N863050O688949P314731P773823P952347Q280596Q764005
4694B32468563R721261J0110439J0369404R777551Q664413P088023N434669L834250
4686B97468573K340561J122733L46186k85779r61290j288362j541835j512049
4678B95688738j396454j219626r12896m74022k91005j9631j46948o03306j032148
4669B89592702j568782k066708l011997m130919n842724p507137q803932r806957
$$ plain form
4661 246853546 236703732 226527165 217061274 208152864 200244823 193029838 186716998 180916675
4653 180916675 175756952 171065881 166871251 162957155 159564849 156479271 153684950 150974454
4645 150974454 148480133 145771120 142736646 139142619 135403624 131397929 127377840 123580456
4637 123580456 120055664 116793860 113641956 110692805 107659905 104935024 102202905 99677385
4629 99677385 97376047 95212720 93187008 91266684 89505768 87773590 86251204 84818216
4621 84818216 83304572 81664995 80045936 78214772 76120976 74070084 71904877 69854663
4613 69854663 67696743 65650496 63735260 61874918 59997242 58183087 56528725 54876151
4605 54876151 53348768 51902725 50474317 49133836 47736159 46312746 44839250 43481410
$$ packed form
4661B46853546j0149814j0176567r465891q908410p908041p214985o312840n800323
4653A80916675n159723m691071m194630l914096l392306l085578k794321k710496
4645A50974454k494321k709013l034474l594027l738995m005695m020089l797384
4637A23580456l524792l261804l151904k949151l032900k724881k732119k525520
4629I9677385k301338k163327k025712j920324j760916j732178j522386j432988
4621H4818216j513644j639577j619059j831164k093796k050892k165207k050214
4613F9854663k157920k046247j915236j860342j877676j814155j654362j652574
4605E4876151j527383j446043j428408j340481j397677j423413j473496j357840
$$ plain form
4597 43481410 42010276 40650554 39360240 38209641 36988088 35961978 35003378 34123456
4589 34123456 33336220 32652841 31943017 31434040 30810575 30257977 29849877 29406092 28847478
4580 28847478 28493060 28001294 27671651 27246882 26915318 26495721 26112205 25728999 25354729
4571 25354729 24974488 24604150 24210249 23838161 23541200 23214313 22911951 22673106 22442222
4562 22442222 22259862 21963871 21702986 21410775 21300854 20907551 20604812 20390563 20097941
4553 20097941 19753461 19359913 19134761 18763095 18549433 18236441 17911889 17664451 17356022
4544 17356022 17179576 16885637 16832982 16552704 16416124 16115584 15990457 15752491 15589551 15417721
4534 15417721 15197821 14976807 14741840 14570868 14318051 14105609 14035387 13701776 13565643 13362418
$$ packed form
4597D3481410j471134j359722j290314j150599j221553j026110r58600q79922
4589C4123456p87236o83379p09824n08977o23465n52598m08100m43785n58614
4580B8847478l54418m91766l29643m24769l31564m19597l83516l83206l74270
4571B5354729l80241l70338l93901l72088k96961l26887l02362k38845k30884
4562B2442222j82360k95991k60885k92211j09921l93303l02739k14249k92622
4553B0097941l44480l93548k25152l71666k13662l12992l24552k47438l08429
4544A7356022j76446k93939n2655k80278j36580l00540j25127k37966j62940j71830
4534A5417721k19900k21014k34967j70972k52817k12442p0222l33611j36133k03225
$$ plain form
4524 13362418 13134272 12959979 12769638 12578725 12455841 12255525 12055976 12039501 11955961 11878443
4514 11878443 11749618 11560338 11455412 11427320 11325573 11280061 11105763 11061400 10836376 10804673
4504 10804673 10582805 10358235 10271491 10166366 9987303 9756954 9592621 9458375 9338738 9128637
4494 9128637 8949345 8860733 8749281 8675655 8661333 8513057 8337182 8113109 7985255 7916032
4484 7916032 7791418 7722859 7590193 7456245 7419821 7269669 7136644 7094661 6917634 6829681
4474 6829681 6698494 6679041 6580969 6533462 6490304 6387887 6358576 6295963 6209495 6121871 6173264
4463 6173264 6052346 5987016 5906951 5864730 5830480 5695120 5710525 5558355 5527483 5455594 5479692
4452 5479692 5322614 5295449 5323283 5140038 5140010 5093567 5041422 5008149 4977169 4918360 4950498 4827308
$$ packed form
4524A3362418k28146j74293j90341j90913j22884k00316j99549j6475q3540p7518
4514A1878443j28825j89280j04926k8092j01747m5512j74298m4363k25024l1703
4504A0804673k21868k24570q6744j05125j79063k30349j64333j34246j19637k10101
4494I128637j79292q8612j11452p3626j4322j48276j75875k24073j27854o9223
4484G916032j24614o8559j32666j33948l6424j50152j33025m1983j77027q7953
4474F829681j31187j9453r8072m7507m3158j02417k9311o2613q6468q7624N1393
4463F173264j20918o5330q0065m2221l4250j35360J5405j52170l0872p1889K4098
4452E479692j57078k7165K7834j83245k8m6443n2145l3273l0980n8809L2138j23190
$$ plain form
4440 4827308 4865461 4666248 4750240 4741578 4659587 4555290 4515129 4479128 4491421 4453225 4378055
4429 4378055 4426465 4250796 4198285 4275531 4330970 4256654 4277699 4174075 4280451 4156860 4078314
4418 4078314 4097170 4016240 4001019 3834970 3920311 3854549 3823375 3761149 3770052 3628901 3591993
4407 3591993 3551542 3498692 3550061 3576128 3409711 3365556 3367832 3259709 3372542 3305594 3307312
4396 3307312 3216127 3179440 3226415 3065738 3168942 3166545 3029579 3008769 3034636 2964815 2888351
4385 2888351 2939859 2828690 2786316 2861961 2757171 2730801 2703392 2680656 2607922 2603047 2736626
4374 2736626 2574791 2502302 2448125 2424604 2469999 2363955 2368215 2410442 2359741 2329923 2294926
4363 2294926 2315147 2322249 2302869 2301932 2168734 2261250 2171115 2133025 2083726 2075728 2110463 2073591
$$ packed form
4440D827308L8153j99213Q3992q662q1991j04297m0161l6001J2293l8196p5170
4429D378055M8410j75669n2511P7246N5439p4316K1045j03624J06376j23591p8546
4418D078314J8856q0930j5221j66049Q5341o5762l1174o2226Q903j41151l6908
4407C591993m0451n2850N1369K6067j66417m4155K276j08123J12833o6948J718
4396C307312r1185l6687M6975j60677J03204k397j36966k0810K5867o9821p6464
4385B888351N1508j11169m2374P5645j04790k6370k7409k2736p2734m875J33579
4374B736626j61835p2489n4177k3521M5395j06044M260M2227n0701k9818l4997
4363B294926K0221P102j9380r37j33198R2516r0135l8090m9299p998L4735l6872
$$ plain form
4351 2073591 2069315 2023197 2036360 2052966 2039668 1984374 1944095 2046173 1978021 1976430 2016995 1949290
4339 1949290 2007704 1991125 1947489 2077366 2034781 2039024 2071168 2077086 2022630 2149801 2247473
4328 2247473 2083161 2076582 2135909 2144020 2114668 1997447 1938986 1916809 1878387 1947102 1856722
4317 1856722 1790599 1865218 1853010 1832215 1907726 1907206 1883850 1887860 1953664 1947652 2056898 2078519
4305 2078519 2156026 2212000 2276241 2361860 2478512 2578715 2517105 2484535 2517706 2441582 2462335
4294 2462335 2392690 2385843 2291728 2221130 2160774 2143745 2092204 2160380 2165051 2169626 2245373 2151170
4282 2151170 2309894 2188498 2335830 2379844 2395914 2521054 2512733 2597005 2643617 2591993 2736807
4271 2736807 2761928 2816086 2778173 2875868 2826373 2784944 2828182 2773082 2850002 2870514 2873595 2864089
$$ packed form
4351B073591m276m6118J3163J6606j3298n5294m0279J02078o8152j591M0565o7705
4339A949290N8414j6579m3636J29877m2585M243L2144N918n4456J27171R7672
4328B247473j64312o579N9327Q111k9352j17221n8461k2177l8422O8715r0380
4317A856722o6123P4619j2208k0795P5511n20k3356M010O5804o012J09246K1621
4305B078519P7507N5974O4241Q5619J16652J00203o1610l2570L3171p6124K0753
4294B462335o9645o847r4115p0598o0356j7029n1541O8176M671M575P5747r4203
4282B151170J58724j21396J47332M4014J6070J25140q321Q4272M6612n1624J44814
4271B736807K5121N4158l7913R7695m9495m1429M3238n5100P6920K0512L081r506
$$ plain form
4259 2864089 2885026 2985756 3040547 2994280 3125100 3183785 3161717 3235464 3385331 3335685 3519709
4248 3519709 3682374 3597428 3785798 3935189 4047529 4191750 4268729 4557517 4696041 4898084
4238 4898084 5074798 5446560 5713974 6118521 6478925 7114540 7600938 8187989 8747762 9227069
4228 9227069 9470842 9492208 9224518 8739476 8291430 7841104 7451588 7003488 6600122 6348301
4218 6348301 5973580 5744675 5319136 4945532 4687826 4394372 3970839 3729361 3484957 3170044
4208 3170044 2940054 2749073 2643404 2486646 2357828 2229620 2052147 2059059 1921805 1865194
4198 1865194 1819461 1662759 1655072 1568320 1605213 1545820 1507432 1394470 1398606 1330322 1324253 1272577
4186 1272577 1229532 1193924 1238047 1091777 1143848 1096570 1108558 1076686 1047579 1084386 933798
$$ packed form
4259B864089K0937J00730N4791m6267J30820N8685k2068P3747J49867m9646J84024
4248C519709J62665q4946J88370J49391J12340J44221P6979K88788J38524K02043
4238D898084J76714L71762K67414M04547L60404O35615M86398N87051N59773M79307
4228I227069K43773K1366k67690m85042m48046m50326l89516m48100m03366k51821
4218F348301l74721k28905m25539l73604k57706k93454m23533k41478k44404l14913
4208C170044k29990j90981j05669j56758j28818j28208j77473O912j37254n6611
4198A865194m5733j56702p687q6752L6893n9393l8388j12962M136o8284o069n1676
4186A272577m3045l5608M4123j46270N2071m7278J1988l1872k9107L6807j50588
$$ plain form
4175 933798 942208 990897 985321 977741 990433 889250 894142 927367 826808 838378 788174 730446
4163 730446 754508 835425 726471 820065 834878 711926 815668 759511 751161 743574 704417
4152 704417 743288 716131 636045 668825 632875 615769 562059 619435 677352 577776 614271 563147
4140 563147 651697 568283 580568 590347 561942 586284 513605 595958 588376 644953 549982 516734
4128 516734 618272 565150 537575 496326 535123 465578 586423 508294 623122 580887 559534
4117 559534 538151 571587 574152 568529 485708 502690 475189 495234 524454 440073 474571 456732
4105 456732 484890 515700 336535 425909 360755 388278 342519 338458 387358 310468 316900 413129
4093 413129 289147 255090 375424 313367 304585 353015 313747 234236 379056 387240 271272
$$ packed form
4175I33798Q410M8689n576p580J2692j01183M892L3225j00559J1570n0204n7728
4163G30446K4062Q0917j08954R3594J4813j22952J03742n6157q350p587l9157
4152G04417L8871k7157q0086L2780l5950j7106n3710N7376N7917r9576L6495n1124
4140E63147Q8550q3414J2285R779k8405K4342p2679Q2353p582N6577r4971l3248
4128E16734J01538n3122k7575m1249L8797o9545J20845p8129J14828m2235k1353
4117E59534k1383L3436K565n623q2821J6982k7501K0045K9220q4381L4498j7839
4105D56732K8158L0810j79165Q9374o5154K7523m5759m061M8900p6890O432R6229
4093D13129j23982l4057J20334o2057q782M8430l9268p9511J44820Q184j15968
$$ plain form
4082 271272 291989 270247 288773 273916 308094 290929 291242 315841 292786 272376 257648 299704
4070 299704 208761 352419 188004 231324 239099 162329 299568 216630 223360 180080 186315 173250
4058 173250 249341 180658 220044 252410 229399 313324 247737 351015 227288 245830 239946
4047 239946 290121 230796 275958 263010 224611 228152 142232 190157 210411 213494 229394 187623
4035 187623 209469 194576 251149 219485 214901 202545 214542 187495 276520 219880 326400 261588
4023 261588 254282 284339 205739 221775 280337 193106 257496 291270 170157 208394 261987 244679
4011 244679 199698 243180 233433 265786 212553 200510 202212 204303 266855 239275 264112 282734
3999 282734 361982 328395 429217 365880 288025 412179 404621 333439 371293 178101 334834
$$ packed form
4082B71272K0717k1742J8526j4857L4178j7165L13K4599k3055k0410j4728M2056
4070B99704r0943J43658j64415M3320P775p6770J37239q2938O730m3280O235j3065
4058A73250P6091o8683L9386L2366k3011Q3925o5587J03278j23727J8542n884
4047B39946N0175n9325M5162j2948l8399L541q5920M7925K0254L083J5900m1771
4035A87623K1846j4893N6573l1664m584j2356J1997k7047Q9025n6640J06520o4812
4023B61588p306L0057p8600J6036N8562q7231O4390L3774j21113L8237N3593j7308
4011B44679m4981M3482r747L2353n3233j2043J702K091O2552k7580K4837J8622
3999B82734P9248l3587J00822o3337p7855J24154p558p1182L7854j93192J56733
$$ plain form
3988 334834 251962 350852 291888 275669 326171 296620 313211 370063 270618 286088 277936 310248
3976 310248 334743 261353 211259 309301 383119 355156 430943 371991 398604 417595 571019
3965 571019 438813 496406 560989 488470 561482 480372 550075 577767 514929 572634 555599
3954 555599 674641 728359 634944 707308 666938 750749 829031 719689 735740 811955 758963
3943 758963 733083 820772 757635 814501 764788 864503 866849 916317 950993 967738 1017215 1147411
3931 1147411 1195944 1227057 1314330 1295568 1280092 1277769 1215887 1212251 1219468 1179250 1115800 996520
3919 996520 981499 930960 873149 930417 788586 839121 796737 835306 866459 906814 823218
3908 823218 830969 897135 943228 1000582 973517 976462 953294 896168 824297 805654 756740 781914
$$ packed form
3988C34834q2872R8890n8964j6219N0502k9551J6591N6852r9445J5470q152L2312
3976C10248K4495p3390n0094R8042P3818k7963P5787n8952K6613J8991J53424
3965E71019j32206N7593O4583p2519P3012q1110O9703K7692o2838N7705j7035
3954E55599J19042N3718r3415P2364m0370Q3811P8282j09342J6051P6215n2992
3943G58963k5880Q7689o3137N6866m9713R9715K346M9468L4676J6745M9477J30196
3931A147411M8533L1113Q7273j8762j5476k323o1882l636P217m0218o3450j19280
3919I96520j5021n0539n7811N7268j41831N0535m2384L8569L1153M0355q3596
3908H23218P751O6166M6093N7354k7065K945k3168n7126p1871j8643m8914K5174
$$ plain form
3896 781914 671219 617249 624680 614988 628553 574057 629925 558815 562349 504530 519432 482815
3884 482815 443721 396519 380801 391078 344953 304855 300368 264796 274433 151163 246398 184751
3872 184751 169214 174286 252733 136229 158733 199094 201778 123811 118800 81214 98592 119162
3860 119162 161192 75776 132605 76060 69828 98965 81135 90623 84022 -255 37970 35339
3848 35339 -11069 19493 24132 -18002 11489 -17634 61934 63635 13841 11949 36298 67808
3836 67808 -33061 -55856 -82025 -71510 23910 -20292 -18699 22357 21474 -41028 -81588 -39851
3824 -39851 31945 -94613 -73690 -50068 13994 -51032 -2277 -8522 -32116 -54863 -146028 6624
3812 6624 -63951 -40302 -86811 -82405 -111385 -80206 -76870 -62738 -137387 -69363 -87679 -77645
$$ packed form
3896G81914j10695n3970P431r692J3565n4496N5868p1110L534n7819J4902l6617
3884D82815l9094m7202j5718J0277m6125m0098m487l5572R637j23270R5235o1647
3872A84751j5537N072P8447j16504K2504M0361K684p7967n011l7586J7378K0570
3860A19162M2030q5416N6829n6545o232K9137j7830R488o601q4277L8225k631
3848C5339m6408L0562M639m2134K9491k9123P9568J701m9794j892K4349L1510
3836F7808j00869k2795k6169J0515R5420m4202J593M1056q83o2502m0560M1737
3824c9851P1796j26558K0923K3622O4062o5026M8755o245k3594k2747r1165J52652
3812F624p0575K3649m6509M406k8980L1179L336J4132p4649O8024j8316J0034
$$ plain form
3800 -77645 -93522 -67293 -26767 -79271 35572 -111918 -31399 -93719 -137662 -155741 -201202
3789 -201202 -75297 -93115 -111686 -91807 -52851 -45679 -152771 -35603 -35692 -38230 -113362 -63543
3777 -63543 -62862 -61752 -153083 -100909 -123371 -155278 -124430 -33229 -111477 -111977 -136318 -97865 -109644
3764 -109644 -84407 -61079 -107226 -117088 -138990 -64115 -73401 -118581 -68232 -100003 -47568 -167621
3752 -167621 -67399 -26466 -94466 -75408 -117569 -110249 -110035 -142819 -147539 -113517 -188356 -141186
3740 -141186 -184750 -159785 -180535 -161156 -63500 -76547 6554 -173844 -132509 -105155 -156987
3729 -156987 -217871 -152708 -88076 -83829 -177194 -184630 -140656 -161880 -154074 -112955 -154274 -284784
3717 -284784 -160547 -160242 -130752 -135271 -94322 -76464 -137012 -139085 -222622 -67704 -87845 -93942
$$ packed form
3800g7645j5877K6229M0526n2504J14843j47490Q0519o2320m3943j8079m5461
3789b01202J25905j7818j8571J9879L8956P172j07092J17168q9k538p5132M9819
3777f3543O81J110r1331N2174k2462l1907L0848R1201p8248n00k4341L8453j1779
3764a09644K5237K3328m6147r862k1902P4875r286m5180N0349l1771N2435j20053
3752a67621J00222M0933o8000J9058m2161P320K14l2784m720L4022p4839M7170
3740a41186m3564K4965k0750J9379R7656j3047Q3101j80398M1335K7354n1832
3729a56987o0884O5163O4632M247r3365p436M3974k1224P806M1119m1319j30510
3717b84784J24237L05K9490m519M0949J7858o0548k073q3537J54918k0141o097
$$ plain form
3705 -93942 -116101 -173904 -157762 -245351 -197432 -157430 -234479 -187332 -117375 -167657 -213616 -214907
3693 -214907 -102494 -101755 -179449 -211804 -148447 -193653 -217694 -115657 -39724 -166021 -216777
3682 -216777 -156640 -139288 -192752 -212768 -234916 -130539 -91894 -193073 -149491 -158953 -179719
3671 -179719 -84012 -122755 -184251 -127814 -165803 -269889 -141942 -210899 -156560 -210205 -176244
3660 -176244 -147581 -144088 -221238 -132064 -123388 -132372 -175404 -127179 -144103 -96221 -128924 -92843
3648 -92843 -176032 -140099 -115466 -138464 -142305 -147254 -119959 -127719 -151956 -208002 -101502 -173681
3636 -173681 -230319 -116075 -143706 -218185 -151599 -205682 -145477 -141418 -146437 -82933 -196063 -197325
3624 -197325 -187003 -167145 -193543 -243616 -104400 -184444 -238859 -236167 -204219 -125335 -205425 -230657
$$ packed form
3705i3942k2159n7803J6142q7589M7919M0002p7049M7147O9957n0282m5959j291
3693b14907J12413P39p7694l2355O3357m5206k4041J02037P5933j26297n0756
3682b16777O0137J7352n3464k0016k2148J04377L8645j01179M3582r462k0766
3671a79719R5707l8743o1496N6437l7989j04086J27947o8957N4339n3645L3961
3660a76244K8663L493p7150Q9174Q676q984m3032M8225j6924M7882l2703L6081
3648i2843q3189L5933K4633k2998l841m949K7295p760k4237n6046J06500p2179
3636a73681n6638J14244k7631p4479O6586n4083O0205M059n019O3504j13130j262
3624a97325J0322J9858k6398n0073J39216q0044n4415K692L1948P8884q0090k5232
$$ plain form
3612 -230657 -220549 -238729 -232853 -187807 -171479 -247249 -248114 -125655 -105484 -138495 -133413 -160065
3600 -160065 -195837 -143139 -215522 -226482 -158669 -245666 -154763 -236873 -142950 -224675 -237145 -241538
3588 -241538 -228553 -216281 -165852 -252477 -167431 -192015 -144387 -234330 -202613 -165894 -224036 -154546
3576 -154546 -176377 -137850 -174214 -237850 -201883 -140730 -276495 -209176 -200792 -148412 -129872 -131338
3564 -131338 -226276 -212094 -250948 -158850 -245247 -147341 -184705 -178169 -162747 -160352 -160915 -240937
3552 -240937 -242131 -207305 -203589 -255330 -171303 -227999 -257058 -190114 -182056 -215265 -150362 -225735
3540 -225735 -171195 -258388 -164544 -182401 -197248 -128842 -152152 -187172 -116517 -184403 -155870 -213984
3528 -213984 -255282 -157805 -172158 -233338 -198222 -110131 -114984 -158660 -139811 -189242 -256459 -171716
$$ packed form
3612b30657J0108j8180N876M5046J6328p5770q65J22459K0171l3011N082k6652
3600a60065l5772N2698p2383j0960O7813q6997R0903q2110R3923q1725j2470m393
3588b41538J2985J2272N0429q6625Q5046k4584M7628q9943L1717L6719n8142O9490
3576a54546k1831L8527l6364o3636L5967O1153j35765O7319Q384N2380J8540j466
3564a31338r4938J4182l8854R2098q6397R7906l7364O536J5422K395n63q0022
3552b40937j194L4826L716n1741Q4027n6696k9059O6944Q058l3209O4903p5373
3540b25735N4540q7193R3844j7857j4847O8406k3310l5020P0655o7886K8533n8114
3528b13984m1298R7477j4353o1180L5116Q8091m853m3676J8849m9431o7217Q4743
$$ plain form
3516 -171716 -152413 -230192 -167931 -196856 -265696 -201741 -177914 -184070 -168707 -210781 -216830 -209141
3504 -209141 -184439 -118590 -201300 -189083 -291543 -111602 -165707 -210676 -173434 -232902 -174094
3493 -174094 -218560 -191208 -222010 -230759 -204773 -214659 -167676 -212504 -224624 -159631 -252947 -181122
3481 -181122 -156555 -205544 -225347 -173428 -195799 -175282 -160137 -228331 -183194 -148115 -163074 -111698
3469 -111698 -285969 -98531 -159832 -146770 -107546 -110128 -165802 -97466 -175695 -73938 -116374
3458 -116374 -181888 -236462 -166446 -125228 -130146 -189312 -240222 -138541 -187126 -158196 -270393
3447 -270393 -182050 -165442 -214777 -184959 -239497 -166872 -243417 -143901 -241802 -206936 -256706 -156674
3435 -156674 -202096 -233278 -206450 -197334 -172994 -123540 -153509 -161425 -207520 -160152 -175036 -174390
$$ packed form
3516a71716J9303p7779O2261k8925o8840O3955K3827o156J5363m2074o049P689
3504b09141K4702O5849q2710J2217j02460J79941n4105m4969L7242n9468N8808
3493a74094m4466K7352l0802q749K5986r886M6983m4828j2120O4993r3316P1825
3481a81122K4567m8989j9803N1919k2371K0517J5145o8194M5137L5079j4959N1376
3469a11698j74271J87438o1301J3062L9224k582n5674O8336p8229J01757m2436
3458a16374o5514n4574P0016M1218m918n9166n0910J01681m8585K8930j12197
3447b70393Q8343J6608m9335K9818n4538P2625p6545R9516r7901L4866m9770J00032
3435a56674m5422l1182K6828R116K4340M9454k9969p916m6095M7368j4884O46
$$ plain form
3423 -174390 -157992 -193078 -194637 -153726 -184354 -172531 -96962 -159995 -74654 -184678 -145905 -191778
3411 -191778 -285887 -214539 -263441 -140604 -187530 -165468 -203342 -186215 -160247 -125515 -105526
3400 -105526 -188073 -189901 -153298 -89312 -236646 -149775 -189765 -71702 -105509 -193047 -102813
3389 -102813 -122590 -191962 -141797 -172761 -141410 -178462 -121455 -234265 -121741 -193781 -111628
3378 -111628 -150064 -138484 -125963 -134336 -166443 -111108 -144210 -172847 -120322 -89771 -202953 -199523
3366 -199523 -126317 -52029 -134281 -108397 -111612 -99384 -150946 -171502 -106177 -24103 -56718 -239193
3354 -239193 -128644 -88260 -121791 -61734 -101105 -98622 -61107 -22275 -39956 -153066 -62007
3343 -62007 -31025 -71883 -798 -77478 4555 -28447 -3401 69868 -68942 12077 33152 -10824
$$ packed form
3423a74390J6398l5086j559M0911l0628J1823P5569o3033Q5341j10024L8773m5873
3411a91778r4109P1348m8902J22837m6926K2062l7874J7127K5968L4732J9989
3400a05526q2547j828L6603O3986j47334Q6871l9990J18063l3807q7538R0234
3389a02813j9777o9372N0165l0964L1351l7052N7007j12810J12524p2040Q2153
3378a11628l8436J1580J2521q373l2107N5335l3102k8637N2525L0551j13182L430
3366a99523P3206P4288q2252K5884l215J2228n1562k0556O5325Q2074l2615j82475
3354b39193J10549M0384l3531O0057l9371K483L7515L8832j7681j13110R1059
3343f2007L0982m0858P1085p6680Q2033l3002K5046P3269j38810Q1019K1075m3976
$$ plain form
3331 -10824 47297 44132 29233 51866 -22654 90530 107635 -52677 60222 91919 136280
3320 136280 128366 64575 163189 139599 172381 189489 309827 211784 215219 304508 282026 284658
3308 284658 443618 451830 502680 694101 726377 765455 1072953 1409437 1896026 2306984 2517195
3297 2517195 2281558 1982169 1517164 1137866 866397 764552 562528 508495 459897 418765
3287 418765 376938 347754 294435 334694 306850 301705 233055 280994 297788 234532 348617 343736
3275 343736 347827 357653 341725 348400 361901 395341 383541 374044 388507 403066 555041 459614
3263 459614 529194 460007 515252 580812 640272 643317 711922 697485 760085 879086 959928 964605
3251 964605 1041585 1069433 1176276 1339912 1610099 1905051 1935886 2206596 2258623 2303986 2496875
$$ packed form
3331a0824N8121l165j4899K2633p4520J13184J7105j60312J12899L1697M4361
3320A36280p914o3791R8614k3590L2782J7108J20338r8043L435Q9289k2482K632
3308B84658J58960Q212N0850J91421L2276L9078L07498L36484M86589M10958K10211
3297B517195k35637k99389m65005l79298k71469j01845k02024n4033m8598m1132
3287D18765m1827k9184n3319M0259k7844n145o8650M7939J6794o3256J14085m881
3275C43736M091R826j5928O675J3501L3440j1800r497J4463J4559J51975r5427
3263D59614O9580o9187N5245O5560N9460L045O8605j4437O2600J19001Q0842M677
3251I64605P6980K7848J06843J63636K70187K94952L0835K70710N2027M5363J92889
$$ plain form
3240 2496875 2795457 3266231 3762017 4766708 6030923 8078949 12090585 17146786 20601005
3231 20601005 20400932 17253108 12584334 9151200 6691294 4971105 3865626 3079823
3223 3079823 2366325 2046542 1853270 1679968 1686673 1570647 1401830 1113211 985895 964294
3213 964294 836805 728347 680363 535611 570948 474909 532287 460697 426264 542717 322052
3202 322052 308430 370252 257157 218876 242999 303660 229366 282832 168175 194578 161831
3191 161831 189187 157643 201129 122751 227429 109222 137670 42432 52572 89066 42139
3180 42139 70765 75217 12650 -5179 -14463 5983 -4262 53374 -27528 16053 35675 -61414
3168 -61414 3337 -5161 -53714 45725 9495 -73816 -115510 -28616 -58527 -4051 -27554 -121782
$$ packed form
3240B496875K98582M70774M95786J004691J264215K048026M011636N056201L454219
3231B0601005k00073l147824m668774l433134k459906j720189j105479p85803
3223C079823p13498l19783j93272j73302O705j16026j68817k88619j27316k1601
3213I64294j27489j08458m7984j44752L5337r6039N7378p1590l4433J16453k20665
3202C22052j3622O1822j13095l8281K4123O0661p4294N3466j14657K6403l2747
3191A61831K7356l1544M3486p8378J04678j18207K8448r5238J0140L6494m6927
3180D2139K8626M452o2567j7829r284K0446j0245N7636q0902M3581J9622r7089
3168f1414O4751q498m8553R9439l6230q3311m1694Q6894k9911N4476k3503r4228
$$ plain form
3156 -121782 -163590 -40763 -157978 -127452 -123869 -69072 -117452 -80440 -100256 -184735 -125813
3145 -125813 -192992 -150909 -117082 -149055 -193144 -101891 -167162 -76491 -91801 -102493 -163319 -108828
3133 -108828 -134906 -120564 -77508 -181951 -79731 -157875 -179160 -178962 -177635 -65502 -114538 -62651
3121 -62651 -188689 -243811 -217705 -218900 -184137 -170642 -195550 -166722 -106577 -130267 -181313 -149190
3109 -149190 -179526 -125242 -247697 -215170 -186704 -157878 -257200 -236676 -228723 -240744 -287164 -239405
3097 -239405 -265728 -192274 -152870 -289190 -188821 -168987 -219527 -205280 -267529 -168374 -195609
3086 -195609 -231682 -159182 -263428 -244766 -251241 -181317 -158335 -168558 -209041 -250728 -192621 -167729
3074 -167729 -181162 -189076 -249718 -249788 -242863 -202370 -312781 -197386 -193838 -269629 -173365 -219125
$$ packed form
3156a21782m1808J22827j17215L0526L583N4797m8380L7012j9816q4479N8922
3145a25813o7179M2083L3827l1973m4089R1253o5271R0671j5310j0692o0826N4491
3133a08828k6078J4342M3056j04443J02220p8144k1285J98J327J12133m9036N1887
3121f2651j26038n5122K6106j195L4763J3495k4908K8828O0145k3690n1046L2123
3109a49190l0336N4284j22455L2527K8466K8826r9322K0524P953j2021m6420M7759
3097b39405k6323P3454L9404j36320J00369J9834n0540J4247o2249R9155k7235
3086a95609l6073P2500j04246J8662o475O9924K2982j0223m0483m1687N8107K4892
3074a67729j3433p914o0642p0O925M0493j10411J15395L548p5791R6264m5760
$$ plain form
3062 -219125 -228889 -194225 -191243 -186493 -233054 -230042 -198610 -179476 -275979 -316458 -253446 -273274
3050 -273274 -266760 -186648 -308589 -166641 -217362 -206886 -222863 -252249 -168633 -161043 -164131 -197915
3038 -197915 -284341 -236767 -141883 -214226 -206689 -172712 -243051 -238902 -224002 -274834 -177252 -229914
3026 -229914 -250659 -243563 -210050 -261943 -213053 -282181 -212142 -222937 -268641 -187938 -273760 -225389
3014 -225389 -255040 -215406 -281997 -227105 -309610 -227804 -294622 -250290 -259306 -179852 -215639 -228790
3002 -228790 -179211 -182799 -229300 -183133 -216553 -166103 -74380 -99238 -92903 -196858 -121996 -241757
2990 -241757 -189902 -202996 -230876 -317677 -208257 -211851 -263822 -315881 -293814 -265274 -248479 -227717
2978 -227717 -247126 -223060 -205311 -243769 -157427 -335357 -331976 -334643 -336319 -279926 -259412 -217629
$$ packed form
3062b19125r764L4664K982M750m6561L012L1432J9134r6503m0479O3012j9828
3050b73274O514Q0112j21941J41948n0721J0476j5977k9386Q3616P590l088l3784
3038a97915q6426M7574R4884p2343P537L3977p0339M149J4900n0832R7582n2662
3026b29914k0745P096L3513n1893M8890o9128P0039j0795m5704Q0703q5822M8371
3014b25389k9651L9634o6591N4892q2505Q1806o6818M4332r016P9454l5787j3151
3002b28790M9579l588m6501M6167l3420N0450R1723k4858O335j03955P4862j19761
2990b41757N1855j3094k7880q6801J09420l594n1971n2059K2067K8540J6795K0762
2978b27717j9409K4066J7749l8458Q6342j77930L381k667j676N6393K0514M1783
$$ plain form
2966 -217629 -244811 -223852 -220835 -326155 -178559 -274640 -283604 -257507 -221389 -294229 -284788 -268409
2954 -268409 -325142 -266563 -298361 -242200 -315099 -316535 -283526 -366280 -244093 -182906 -293726
2943 -293726 -268248 -269092 -190054 -206841 -286281 -266948 -306347 -311765 -273878 -338182 -313867 -286751
2931 -286751 -268395 -179402 -291066 -274751 -256196 -197063 -249383 -150220 -386276 -200752 -299472
2920 -299472 -249924 -206804 -342280 -258181 -233120 -298831 -240312 -234885 -244899 -191181 -234528 -288304
2908 -288304 -193379 -236793 -271663 -185818 -282011 -335726 -221717 -258599 -242149 -358473 -195387
2897 -195387 -219973 -308953 -278965 -308546 -252331 -291578 -313607 -197994 -290179 -243600 -177912
2886 -177912 -239402 -262241 -309178 -246610 -263279 -332182 -271050 -278817 -251760 -274279 -263208 -285926
$$ packed form
2966b17629k7182K0959L017j05320J47596r6081q964K6097L6118p2840R441J6379
2954b68409n6733N8579l1798N6161p2899j436L3009q2754J22187O1187j10820
2943b93726K5478q44P9038j6787p9440J9333l9399n418L7887o4304K4315K7116
2931b86751J8356Q8993j11664J6315J8555N9133n2320R9163k36056J85524r8720
2920b99472M9548M3120j35476Q4099K5061o5711N8519N427j0014N3718m3347n3776
2908b88304R4925m3414l4870Q5845r6193n3715J14009l6882J6450j16324J63086
2897a95387k4586q8980K9988k9581N6215l9247k2029J15613r2185M6579O5688
2886a77912o1490k2839m6937O2568j6669o8903O1132p767K7057k2519J1071k2718
$$ plain form
2874 -285926 -214519 -216123 -251044 -325033 -253421 -212155 -302169 -278793 -281574 -306171 -298518 -303743
2862 -303743 -209480 -276077 -222403 -304340 -425291 -268090 -328631 -315704 -261732 -245784 -258451
2851 -258451 -261605 -297727 -353015 -266316 -292642 -224890 -264986 -255514 -181355 -312994 -251652 -278884
2839 -278884 -252753 -338201 -306913 -246962 -265772 -223561 -296156 -296663 -336572 -210188 -302970 -258868
2827 -258868 -314845 -304169 -263128 -234299 -293547 -250940 -242732 -273666 -296170 -355644 -269000 -338027
2815 -338027 -368466 -305772 -278085 -297915 -307336 -292525 -243925 -242598 -146933 -244298 -254716 -341093
2803 -341093 -276691 -281721 -336312 -261895 -266775 -229650 -239932 -342963 -276164 -254859 -315091 -240462
2791 -240462 -276987 -281592 -307321 -265630 -270615 -236148 -282417 -405274 -281396 -336649 -250467 -257697
$$ packed form
2874b85926P1407j604l4921p3989P1612M1266r0014K3376k781k4597P653n225
2862c03743R4263o6597N3674q1937j20951J57201o0541J2927N3972J5948j2667
2851b58451l154l6122n5288Q6699k6326O7752m0096R472P4159j31639O1342k7232
2839b78884K6131q5448L1288N9951j8810M2211p2595n07l9909J26384r2782M4102
2827b58868n5977J0676M1041K8829n9248M2607Q208l0934k2504n9474Q6644o9027
2815c38027l0439O2694K7687j9830r421J4811M8600J327R5665r7365j0418q6377
2803c41093O4402n030n4591P4417m880L7125j0282j03031O6799K1305o0232P4629
2791b40462l6525m605k5729M1691m985L4467m6269j22857J23878n5253Q6182p230
$$ plain form
2779 -257697 -271851 -290435 -264704 -282085 -277052 -281593 -221509 -232734 -265258 -304173 -266532 -213906
2767 -213906 -271126 -236149 -270891 -322217 -296543 -312699 -280337 -314620 -269118 -249669 -258001 -283844
2755 -283844 -298760 -331093 -274144 -254396 -292714 -256508 -292515 -312691 -197543 -234870 -285033
2744 -285033 -255847 -261892 -260170 -357537 -302812 -328404 -256446 -250412 -228349 -279474 -312306 -305484
2732 -305484 -268027 -208609 -259671 -194667 -351934 -300247 -272244 -281517 -297554 -249967 -286236 -313319
2720 -313319 -234195 -304686 -281588 -323770 -330811 -315144 -251431 -238427 -287321 -306485 -268092 -266508
2708 -266508 -231743 -287649 -299702 -320941 -306619 -241277 -266532 -275373 -299364 -320986 -249745 -278588
2696 -278588 -336412 -319355 -225842 -278219 -294213 -276910 -227751 -289430 -305560 -267017 -256423 -253030
$$ packed form
2779b57697j4154j8584K5731j7381N033m541O0084j1225l2524l8915L7641N2626
2767b13906n7220L4977l4742n1326K5674j6156L2362l4283M5502J9449q332k5843
2755b83844j4916l2333N6949J9748l8318L6206l6007k0176J15148l7327n0163
2744b85033K9186o045J722r7367N4725k5592P1958O034K2063n1125l2832O822
2732c05484L7457N9418n1062O5004j57267N1687K8003r273j6037M7587l6269k7083
2720c13319P9124p0491K3098m2182p041J5667O3713J3004m8894j9164L8393J584
2708b66508L4765n5906j2053k1239J4322O5342k5255q841k3991k1622P1241k8843
2696b78588n7824J7057R3513n2377j5994J7303M9159o1679j6130L8543J0594L393
$$ plain form
2684 -253030 -375661 -268229 -258593 -252050 -307153 -300010 -272281 -299181 -246845 -250070 -233290 -300807
2672 -300807 -266703 -341358 -262374 -238796 -291411 -366091 -333861 -219274 -263481 -261297 -341588 -307440
2660 -307440 -222044 -303958 -280602 -247864 -257717 -263671 -254223 -195472 -247574 -264769 -287121 -291899
2648 -291899 -255046 -302837 -227899 -329259 -271108 -248373 -319156 -233307 -229104 -222471 -260204 -300265
2636 -300265 -297572 -212877 -246211 -311804 -277811 -244203 -283261 -326575 -279603 -303317 -306069 -305615
2624 -305615 -341332 -163764 -328699 -263459 -239679 -273209 -287974 -284772 -352857 -390166 -300053
2613 -300053 -352890 -268219 -280941 -248990 -267885 -322141 -298613 -297298 -344920 -257719 -297202 -318201
2601 -318201 -348397 -290204 -274085 -350711 -219402 -227067 -297930 -313939 -296536 -283052 -251334 -277346
$$ packed form
2684b53030j22631J07432R636O543n5103P143K7729k6900N2336l225J6780o7517
2672c00807L4104p4655P8984K3578n2615p4680L2230J14587m4207K184q0291L4148
2660c07440Q5396q1914K3356L2738r853n954R448N8751n2102j7195k2352m778
2648b91899L6853m7791P4938j01360N8151K2735p0783Q5849M203O633l7733m0061
2636c00265K693Q4695l3334o5593L3993L3608l9058m3314M6972k3714k752M54
2624c05615l5717J77568j64935O5240K3780l3530j4765L202o8085l7309R0113
2613c00053n2837Q4671j2722L1951j8895n4256K3528J315m7622Q7201l9483k0999
2601c18201l0196N8193J6119p6626J31309p665p0863j6009J7403J3484L1718k6012
$$ plain form
2589 -277346 -285219 -326339 -310088 -333634 -232660 -318683 -337286 -322156 -307250 -278449 -240526 -318240
2577 -318240 -298178 -285277 -271468 -268155 -287906 -271112 -286294 -331534 -300821 -285667 -262322 -280714
2565 -280714 -283558 -367190 -324282 -293442 -257187 -321284 -329071 -196108 -267090 -297326 -299119 -239016
2553 -239016 -269666 -241266 -281127 -272410 -254852 -302641 -365688 -249289 -201241 -363072 -197526
2542 -197526 -314794 -235783 -301905 -337139 -303783 -298165 -250848 -331048 -248701 -350259 -214936
2531 -214936 -300324 -259149 -272223 -173904 -363992 -252213 -336500 -271090 -313976 -298718 -213236
2520 -213236 -245993 -226354 -308015 -267064 -218513 -329743 -269837 -299046 -324359 -206778 -318398
2509 -318398 -186044 -308131 -257543 -277830 -344443 -280222 -269835 -271767 -289672 -210420 -279859
$$ packed form
2589b77346p873m1120J6251k3546J00974q6023j8603J5130J4906K8801L7923p7714
2577c18240K0062J2901J3809L313j9751J6794j5182m5240L0713J5154K3345j8392
2565b80714k844q3632M2908L0840L6255o4097p787J32963p0982l0236j793O0103
2553b39016l0650K8400l9861Q717J7558m7789o3047J16399M8048j61831J65546
2542a97526j17268P9011o6122l5234L3356N618M7317q0200Q2347j01558J35323
2531b14936q5388M1175j3074R8319j90088J11779q4287O5410m2886J5258Q5482
2520b13236l2757J9639q1661M0951M8551j11230N9906k9209k5313J17581j11620
2509c18398J32354j22087N0588k0287o6613O4221J0387j932j7905P9252o9439
$$ plain form
2498 -279859 -360799 -336731 -272153 -304566 -262550 -244482 -301061 -255412 -302071 -295988 -375357 -304124
2486 -304124 -251391 -317926 -312392 -410523 -297867 -332745 -324252 -292428 -262718 -342093 -291212 -283991
2474 -283991 -263772 -344529 -366645 -258521 -352826 -289825 -294542 -284806 -260473 -324525 -332208 -373308
2462 -373308 -219624 -270876 -284928 -269530 -265464 -268307 -252439 -353224 -270067 -363030 -284069 -234609
2450 -234609 -283431 -277934 -244091 -260891 -397600 -213565 -326245 -227479 -246682 -251231 -329934
2439 -329934 -386227 -248634 -263910 -244261 -260884 -250586 -275056 -267484 -239613 -313260 -354163 -369414
2427 -369414 -318382 -263975 -272901 -210861 -281766 -332000 -164002 -246335 -271359 -207030 -292269 -278216
2415 -278216 -247015 -283410 -259413 -324724 -357227 -315118 -230607 -273128 -244840 -365781 -394051
$$ packed form
2498b79859q0940K4068O4578l2413M2016J8068n6579M5649m6659O083p9369P1233
2486c04124N2733o6535N534r8131J12656l4878Q493L1824K9710p9375N0881P221
2474b83991K0219q0757k2116J08124r4305O3001m717R736K4333o4052p683m1100
2462c73308J53684n1252j4052J5398M066k843J5868j00785Q3157r2963P8961M9460
2450b34609m8822N497L3843j6800j36709J84035j12680R8766j9203m549p8703
2439c29934n6293J37593j5276J9649j6623J0298k4470P572K7871p3647m0903j5251
2427c69414N1032N4407q926O2040p0905n0234J67998q2333k5024O4329q5239J4053
2415b78216L1201l6395K3997o5311l2503M2109Q4511m2521K8288j20941k8270
$$ plain form
2404 -394051 -326540 -287603 -305662 -278964 -263130 -338763 -270103 -366610 -348675 -340230 -334881 -305363
2392 -305363 -353474 -244906 -347865 -368022 -342110 -283821 -304841 -299372 -285476 -292235 -295686 -256448
2380 -256448 -273875 -267030 -296368 -297473 -342509 -344879 -315476 -229718 -330771 -347963 -298895 -378774
2368 -378774 -259644 -310747 -343557 -320478 -341685 -286092 -277128 -256010 -273623 -281408 -284802 -275990
2356 -275990 -292916 -291776 -370072 -298250 -328016 -217768 -295295 -308577 -269524 -246131 -328739 -286904
2344 -286904 -277195 -239251 -365490 -233909 -313505 -256533 -323352 -230151 -337306 -303296 -295284
2333 -295284 -316510 -319108 -301007 -330591 -289586 -348412 -321019 -276008 -329035 -293612 -265306 -306309
2321 -306309 -314503 -230885 -282413 -214967 -324672 -310626 -258190 -328024 -261350 -304058 -233217 -274012
$$ packed form
2404c94051O7511L8937j8059K6698J5834p5633O8660r6507J7935Q445N349K9518
2392c05363m8111J08568j02959k0157K5912N8289k1020N469J3896o759l451L9238
2380b56448j7427O845k9338j105m5036k370K9403Q5758j01053j7192M9068p9879
2368c78774J19130n1103l2810K3079k1207N5593Q964K1118j7613p785l394Q812
2356b75990j6926J140p8296P1822k9766J10248p7527j3282L9053K3393q2608M1835
2344b86904R709L7944j26239J31581p9596N6972o6819R3201j07155L4010Q012
2333b95284k1226k598J8101k9584M1005n8826K7393M5011n3027L5423K8306m1003
2321c06309q194Q3618n1528O7446j09705J4046N2436o9834O6674m2708P0841m0795
$$ plain form
2309 -274012 -318530 -332970 -213465 -235500 -360868 -299360 -240509 -289994 -311734 -291235 -260926
2298 -260926 -300559 -274573 -158483 -323570 -260971 -318242 -341311 -318577 -292388 -325365 -271224
2287 -271224 -330781 -375572 -253312 -272460 -320551 -310534 -342438 -344592 -317334 -245319 -223613 -315757
2275 -315757 -264822 -300045 -304155 -272088 -207999 -335682 -241605 -249559 -256662 -255924 -320499 -273718
2263 -273718 -280327 -400486 -303090 -303288 -320939 -349653 -283928 -265112 -340664 -299613 -315203 -285935
2251 -285935 -296779 -305594 -302270 -270912 -330219 -326174 -233159 -258568 -310053 -255416 -336203 -322441
2239 -322441 -302140 -285304 -329102 -242113 -330392 -287525 -278228 -193099 -307392 -269064 -309267 -310759
2227 -310759 -240481 -287473 -307112 -241220 -286526 -348326 -308267 -298280 -326567 -255728 -314893 -279374
$$ packed form
2309b74012m4518j4440J19505k2035j25368O1508N8851m9485k1740K0499L0309
2298b60926l9633K5986J16090j65087O2599n7271k3069K2734K6189l2977N4141
2287b71224n9557m4791J22260j9148m8091J0017l1904k154K7258P2015K1706r2144
2275c15757N0935l5223m110L2067O4089j27683R4077p954p103P38o4575M6781
2263b73718o609j20159R7396j98j7651k8714O5725J8816p5552M1051j5590K9268
2251b85935j0844q815L324L1358n9307M045R3015k5409n1485N4637q0787J3762
2239c22441K0301J6836m3798Q6989q8279M2867R297Q5129j14293L8328m0203j492
2227c10759P0278m6992j9639O5892m5306o1800M0059R987k8287P0839n9165L5519
$$ plain form
2215 -279374 -324929 -208252 -295157 -321199 -294539 -267727 -381346 -332069 -251884 -275644 -262985
2204 -262985 -245217 -233158 -267830 -265113 -284947 -258093 -403572 -227572 -248783 -310076 -275304
2193 -275304 -310771 -328495 -294126 -276784 -308774 -321120 -286231 -275968 -294920 -301675 -260499 -278723
2181 -278723 -237760 -287355 -267667 -332887 -337477 -320287 -288828 -268208 -328151 -312513 -320200 -288087
2169 -288087 -316971 -265969 -313977 -319579 -355565 -259351 -383212 -276436 -343170 -336726 -260922 -270748
2157 -270748 -293155 -287987 -251948 -295255 -373623 -281654 -300449 -238235 -380048 -331528 -369135 -257967
2145 -257967 -320305 -254443 -333648 -318283 -297990 -286196 -313433 -263264 -283944 -322180 -288600 -319771
2133 -319771 -286290 -366748 -350310 -243058 -284964 -389555 -335776 -337296 -352121 -298487 -264224
$$ packed form
2215b79374m5555J16677q6905k6042K6660K6812j13619M9277Q0185k3760J2659
2204b62985J7768J2059l4672K717j9834K6854j45479J76000k1211o1293L4772
2193b75304l5467j7724L4369J7342l1990j2346L4889J0263j8952o755M1176j8224
2181b78723M0963m9595J9688o5220m590J7190L1459K0620n9943J5638p687L2113
2169b88087k8884N1002m8008n602l5986R6214j23861J06776o6734O444P5804r826
2157b70748k2407N168L6039m3307p8368R1969j8795O2214j41813M8520l7607J11168
2145b57967o2338O5862p9205J5365K0293J1794k7237N0169k0680l8236L3580l1171
2133c19771L3481q0458J6438J07252m1906j04591N3779j520j4825N3634L4263
$$ plain form
2122 -264224 -282897 -289285 -359370 -329104 -375182 -385023 -287210 -314091 -311099 -325150 -321603 -329775 -238940
2109 -238940 -358062 -214208 -330298 -360595 -312836 -301456 -364557 -325353 -402591 -321684 -333742
2098 -333742 -277820 -267984 -286047 -251556 -259780 -230611 -286569 -290290 -351472 -229550 -363456 -402709
2086 -402709 -350875 -282525 -255617 -246249 -253965 -331743 -313881 -307197 -296319 -327064 -258180 -275790
2074 -275790 -340099 -258170 -346644 -357917 -261113 -367338 -319730 -357782 -346499 -301865 -395443
2063 -395443 -330610 -321105 -313226 -303028 -277980 -342031 -289147 -284603 -310074 -298936 -330238 -345801
2051 -345801 -331712 -286022 -386009 -340351 -361845 -305903 -339909 -401975 -261465 -292709 -321678
2040 -321678 -263526 -264441 -348511 -244659 -321686 -319682 -384486 -263045 -263170 -279242 -316869 -273898
$$ packed form
2122b64224j8673o388p0085L0266m6078r841R7813k6881K992j4051L547q172R0835
2109b38940j19122J43854j16090l0297M7759J1380o3101L9204p7238Q0907j2058
2098c33742N5922R836j8063L4491q224K9169n5958l721o1182J21922j33906l9253
2086d02709N1834O8350K6908R368p716p7778J7862O684J0878l0745O8884j7610
2074b75790o4309Q1929q8474j1273R6804j06225M7608l8052J1283M4634r3578
2063c95443O4833R505P879J0198K5048o4051N2884M544k5471J1138l1302j5563
2051c45801J4089M5690r9987M5658k1494N5942l4006o2066J40510l1244k8969
2040c21678N8152r15q4070J03852p7027K004o4804J21441j25j6072l7627M2971
$$ plain form
2028 -273898 -327141 -375729 -307542 -261348 -327772 -380388 -267748 -308589 -290032 -311967 -268829
2017 -268829 -318401 -279121 -290440 -292744 -287658 -274332 -369723 -378051 -362700 -328742 -336418 -285682
2005 -285682 -275992 -188570 -355884 -332043 -351146 -288022 -354968 -264790 -256313 -344187 -285754 -187940
1993 -187940 -280996 -308591 -257843 -340841 -257059 -327189 -347040 -276160 -360119 -349280 -337182 -286003
1981 -286003 -283412 -277604 -262214 -362940 -353225 -274404 -308354 -301651 -339133 -277676 -245045 -253538
1969 -253538 -334947 -300398 -237451 -291731 -256895 -257781 -253131 -287805 -320036 -279472 -352030 -301245
1957 -301245 -275259 -305868 -255310 -263235 -309128 -320340 -311666 -302890 -316381 -333743 -308474 -357277
1945 -357277 -345595 -358128 -239134 -314782 -309745 -327841 -336121 -341674 -253255 -304169 -302357 -282849
$$ packed form
2028b73898n3243m8588O8187M6194o6424n2616J12640m0841J8557k1935M3138
2017b68829m9572L9280j1319k304N086J3326r5391q328J5351L3958p676N0736
2005b85682R690Q7422j67314K3841j9103O3124o6946R0178Q477q7874N8433R7814
1993a87940r3056k7595N0748q2998Q3782p0130j9851P0880q3959J0839J2098N1179
1981b86003K591N808J5390j00726R715P8821l3950O703l7482O1457L2631q493
1969b53538q1409L4549O2947n4280L4836q86M650l4674l2231M0564p2558N0785
1957c01245K5986l0609N0558p925m5893j1212Q674Q776j3491j7362K5269m8803
1945c57277J1682j2533J18994p5648N037j8096q280n553Q8419n0914J812J9508
$$ plain form
1933 -282849 -331349 -268287 -347286 -370074 -329949 -322555 -336397 -268530 -316908 -252871 -327847 -326811
1921 -326811 -358459 -386309 -332868 -348340 -288063 -320909 -304654 -252065 -242714 -351838 -299313 -342699
1909 -342699 -344519 -270372 -355771 -309946 -292731 -395889 -312696 -296527 -320710 -290911 -354313 -324758
1897 -324758 -322881 -256877 -295439 -314211 -301425 -254230 -361269 -260337 -264561 -284058 -304072 -262678
1885 -262678 -276226 -271326 -275641 -295636 -386518 -302246 -298822 -285549 -345199 -254045 -262040 -251192
1873 -251192 -281715 -221909 -335252 -241272 -311618 -297063 -176342 -291143 -182705 -315907 -309868
1862 -309868 -286585 -283293 -291510 -420401 -383322 -313899 -301650 -378018 -301139 -300100 -329804 -367066
1850 -367066 -259362 -266436 -340994 -389581 -307144 -355473 -374490 -440184 -305560 -310568 -241324 -301222
$$ packed form
1933b82849m8500O3062p8999k2788M0125P394j3842O7867m8378O4037p4976J036
1921c26811l1648k7850N3441j5472O0277l2846J6255N2589R351j09124N2525m3386
1909c42699j820P4147q5399M5825J7215j03158Q3193J6169k4183K9799o3402K9555
1897c24758J877O6004l8562j8772J2786M7195j07039J00932m224j9497k0014M1394
1885b62678j3548M900m315j9995r0882Q4272L424J3273n9650R1154p995J0848
1873b51192l0523N9806j13343R3980p0346J4555J20721j14801J08438j33202O039
1862c09868K3283L292q217j28891L7079O9423J2249p6368P6879J039k9704l7262
1850c67066J07704p074p4558m8587Q2437m8329j9017o5694J34624n008O9244n9898
$$ plain form
1838 -301222 -304695 -257946 -387172 -323245 -294184 -319104 -315367 -356354 -259214 -306129 -238756 -295398
1826 -295398 -242276 -344121 -313537 -228060 -347705 -276983 -230121 -280044 -414176 -251265 -335992
1815 -335992 -296877 -307639 -352782 -385741 -297379 -249494 -290524 -274575 -299841 -271989 -419491
1804 -419491 -284366 -284928 -364608 -248012 -358014 -316127 -380427 -292027 -279322 -335443 -275148
1793 -275148 -265595 -332468 -250754 -310412 -344090 -295009 -250360 -301958 -231245 -366515 -305001 -351543
1781 -351543 -252247 -295620 -350710 -303023 -366289 -258249 -358549 -275748 -294430 -359109 -216036
1770 -216036 -326454 -330885 -368422 -328707 -305475 -277819 -294110 -230161 -362707 -248225 -254757
1759 -254757 -314739 -356237 -316619 -300177 -299651 -280087 -339565 -333925 -272410 -325652 -349352 -356916
$$ packed form
1838c01222l473M6749j29226O3927K9061k4920L737m0987R7140m6915O7373n6642
1826b95398N3122j01845L0584Q5477j19645P0722M6862m9923j34132J62911q4727
1815c35992L9115j0762m5143l2959Q8362M7885m1030J5949k5266K7852j47502
1804d19491J35125n62p9680J16596j10002M1887o4300Q8400J2705n6121O0295
1793b75148R553o6873Q1714n9658l3678M9081M4649n1598P0713j35270O1514m6542
1781c51543R9296m3373n5090M7687o3266J08040j00300Q2801j8682o4679J43073
1770b16036j10418m431l7537L9715K3232K7656j6291O3949j32546J14482o532
1759b54757n9982m1498L9618J6442N26J9564n9478N640O1515n3242k3700p564
$$ plain form
1747 -356916 -345147 -320966 -361938 -312732 -286829 -298875 -393811 -295079 -299361 -255995 -318441 -365960
1735 -365960 -336406 -364846 -319201 -367289 -242469 -397107 -301059 -327573 -347357 -330488 -403031
1724 -403031 -314069 -291488 -318922 -247533 -347654 -326988 -301525 -290819 -356622 -289807 -315684
1713 -315684 -328007 -343017 -310301 -214181 -221955 -373363 -263220 -374430 -313093 -353882 -306170
1702 -306170 -279313 -247218 -291465 -352642 -306474 -280097 -288270 -340718 -286699 -337065 -366473 -315836
1690 -315836 -299678 -269220 -369024 -241330 -335595 -346833 -264060 -230102 -293426 -330538 -344053
1679 -344053 -326802 -346561 -222883 -325139 -241848 -289119 -294961 -334376 -313365 -347389 -268251
1668 -268251 -324174 -327993 -300103 -322763 -360298 -346621 -293121 -282228 -474411 -359697 -386050
$$ packed form
1747c56916J1769K4181m0972M9206K5903j2046r4936R8732m282M3366o2446m7519
1735c65960K9554k8440M5645m8088J24820j54638R6048k6514j9784J6869p2543
1724d03031Q8962K2581k7434P1389j00121K0666K5463J0706o5803O6815k5877
1713c15684j2323j5010L2716R6120p774j51408J10143j11210O1337m0789M7712
1702c06170K6857L2095m4247o1177M6168K6377q173n2448N4019n0366k9408N0637
1690c15836J6158L0458r9804J27694r4265j1238Q2773L3958o3324l7112j3515
1679c44053J7251j9759J23678j02256Q3291m7271n842l9415K1011l4024P9138
1668b68251n5923l819K7890k2660l7535J3677N3500J0893j92183J14714k6353
$$ plain form
1657 -386050 -251524 -322874 -340322 -267068 -294689 -289137 -311485 -404863 -282551 -312678 -285525
1646 -285525 -337005 -257554 -243541 -332191 -312586 -275295 -338770 -317894 -374875 -293841 -399326
1635 -399326 -244403 -301078 -369568 -317045 -295440 -254643 -321671 -242099 -305160 -265163 -365463
1624 -365463 -283135 -207690 -320159 -348920 -328234 -352199 -402808 -340845 -329320 -298060 -326943
1613 -326943 -315736 -308513 -338433 -287823 -299687 -327103 -297528 -324299 -361259 -325776 -410054 -339658
1601 -339658 -355559 -382854 -423864 -351526 -314206 -317552 -276029 -321614 -327519 -280804 -360501 -326760
1589 -326760 -297304 -283079 -302393 -356430 -392048 -265962 -361278 -335129 -337743 -221868 -357829
1578 -357829 -249030 -340289 -218026 -338995 -316909 -267244 -288387 -366654 -339286 -339974 -325206
$$ packed form
1657c86050J34526p1350j7448P3254k7621N552k2348r3378J22312l0127K7153
1646b85525n1480P9451J4013q8650J9605L7291o3475K0876n6981Q1034j05485
1635c99326J54923n6675o8490N2523K1605M0797o7028P9572o3061L9997j00300
1624c65463Q2328P5445j12469k8761K0686k3965n0609O1963J1525L1260k8883
1613c26943J1207P223k9920N0610j1864k7416K9575k6771l6960L5483q4278P0396
1601c39658j5901k7295m1010P2338L7320l346M1523m5585n905M6715p9697L3741
1589c26760K9456J4225j9314n4037l5618J26086r5316K6149k614J15875j35961
1578c57829J08799r1259J22263j20969K2086M9665k1143p8267K7368o88J4768
$$ plain form
1567 -325206 -315895 -315446 -341097 -299585 -269296 -368452 -240830 -255420 -393898 -319505 -411847 -318351
1555 -318351 -420384 -284678 -279079 -373971 -321016 -310290 -309224 -267709 -440051 -347329 -393201
1544 -393201 -350469 -276101 -254634 -307558 -303918 -276850 -304692 -323527 -292475 -406071 -320173 -351674
1532 -351674 -308890 -328687 -251089 -314536 -335987 -298688 -251478 -309346 -341893 -320936 -317929 -350761
$$ packed form
1567c25206R311M49k5651M1512L0289r9156J27622j4590j38478P4393r2342R3496
1555c18351j02033J35706N599r4892N2955J0726J066M1515j72342R2722m5872
1544c93201M2732P4368K1467n2924L640K7068k7842j8835L1052j13596Q5898l1501
1532c51674M2784j9797P7598o3447k1451L7299M7210n7868l2547K0957L007l2832
$$ [...]
##END NTUPLES=NMR SPECTRUM
##END=
