##TITLE=abcd
##JCAMPDX= 6.0         $$ Bruker NMR JCAMP-DX V2.0
##DATA TYPE= NMR SPECTRUM
##DATA CLASS= NTUPLES
##ORIGIN= UXNMR, Bruker Analytische Messtechnik GmbH
##OWNER= root
$$ XWIN-NMR		Version 3.5
$$ Fri Dec 12 13:24:30 2025 Russian Standard Time (UT+4h)  servis@DPX200
##.OBSERVE FREQUENCY= 200.131235884673
##.OBSERVE NUCLEUS= ^1H
##.ACQUISITION MODE= SIMULTANEOUS
##.ACQUISITION SCHEME= undefined
##.AVERAGES= 32
##.DIGITISER RES= 18
##SPECTROMETER/DATA SYSTEM= spect
##.PULSE SEQUENCE= zg
##.SOLVENT NAME= CDCl3
##.SHIFT REFERENCE= (INTERNAL, CDCl3, 0, 16.4885)
##AUDIT TRAIL= $$ (NUMBER, WHEN, WHO, WHERE, WHAT)
$$ ##TITLE= Audit trail, XWIN-NMR		Version 3.5
$$ ##JCAMPDX= 5.01
$$ ##ORIGIN= Bruker BioSpin GmbH
$$ ##OWNER= servis
$$ F:\spectra/data/av/nmr/H1/1/pdata/1/auditp.txt
$$ ##AUDIT TRAIL=  $$ (NUMBER, WHEN, WHO, WHERE, WHAT)
(   1,<2025-12-12 13:24:00.90 +0400>,<servis>,<DPX200>,
      <created by zg, POWCHK disabled, PULCHK disabled
       configuration hash MD5:
       00 E9 B6 7A A2 85 ED C7 34 08 36 98 17 FE 4E 26
       data hash MD5: 32K
       7E 9F 91 05 3F 3F 04 7B DB B4 F9 ED A3 5F 11 39>)
(   2,<2025-12-12 13:24:02.62 +0400>,<servis>,<DPX200>,
      <Start of raw data processing
       efp BC_mod = 2 LB = 0.05 FT_mod = 6 PKNL = 1 PHC0 = -263.2463 PHC1 = 6.301564 SI = 16K 
       data hash MD5: 16K
       C3 81 24 18 B9 46 FE 34 3D 66 D2 0E 4F E4 36 24>)
$$ ##END=
$$ 
$$ hash MD5
$$ 47 E9 62 43 3B D6 CF D6 ED 08 67 9E 55 63 6E E2
##$RELAX= 
##$RELAX= 
##$RELAX= 
##$RELAX= 
##$RELAX= 
##$RELAX= 
##$RELAX= 
##$RELAX= 
$$ Bruker specific parameters
$$ --------------------------
##$DU= <F:\spectra>
##$EXPNO= 1
##$NAME= <H1>
##$PROCNO= 1
##$TYPE= <nmr>
##$USER= <av>
##$AMP= (0..31)
100 100 100 100 100 100 100 100 100 100 100 100 100 100 100 100 100 100 
100 100 100 100 100 100 100 100 100 100 100 100 100 100 
##$AQSEQ= 0
##$AQ_mod= 1
##$AUNM= <au_zg>
##$AUTOPOS= <>
##$BF1= 200.13
##$BF2= 200.13
##$BF3= 200.13
##$BF4= 200.13
##$BF5= 500.13
##$BF6= 500.13
##$BF7= 500.13
##$BF8= 500.13
##$BYTORDA= 1
##$CFDGTYP= 0
##$CFRGTYP= 5
##$CHEMSTR= <none>
##$CNST= (0..31)
1 1 145 1 1 1 1 1 1 1 1 1 1 1 1 1 1 1 1 1 1 1 1 1 1 1 1 1 1 1 1 1 
##$CPDPRG= <>
##$CPDPRG1= <>
##$CPDPRG2= <>
##$CPDPRG3= <>
##$CPDPRG4= <mlev>
##$CPDPRG5= <mlev>
##$CPDPRG6= <mlev>
##$CPDPRG7= <mlev>
##$CPDPRG8= <mlev>
##$CPDPRGB= <>
##$CPDPRGT= <>
##$D= (0..31)
0 2 0 0 0 0 0 0 0 0.06 0 0 0 0 0 0 0.0002 0 0 0 0 0 0 0 0 0 0 0 0 0 0 
0 
##$DATE= 1765531440
##$DBL= (0..7)
120 120 120 120 120 120 120 120 
##$DBP= (0..7)
150 150 150 150 150 150 150 150 
##$DBP07= 0
##$DBPNAM0= <>
##$DBPNAM1= <>
##$DBPNAM2= <>
##$DBPNAM3= <>
##$DBPNAM4= <>
##$DBPNAM5= <>
##$DBPNAM6= <>
##$DBPNAM7= <>
##$DBPOAL= (0..7)
0.5 0.5 0.5 0.5 0.5 0.5 0.5 0.5 
##$DBPOFFS= (0..7)
0 0 0 0 0 0 0 0 
##$DE= 6
##$DECBNUC= <off>
##$DECIM= 32
##$DECNUC= <off>
##$DECSTAT= 4
##$DIGMOD= 1
##$DIGTYP= 9
##$DL= (0..7)
0 120 120 120 120 120 120 120 
##$DP= (0..7)
150 150 150 150 150 150 150 150 
##$DP07= 0
##$DPNAME0= <>
$$ [...]
##$SUBNAM4= <"">
##$SUBNAM5= <"">
##$SUBNAM6= <"">
##$SUBNAM7= <"">
##$SUBNAM8= <"">
##$SUBNAM9= <"">
##$SW= 20.6817932712277
##$SWIBOX= (0..15)
0 0 3 0 0 0 0 0 0 0 0 0 0 0 0 0 
##$SW_h= 4139.07284768212
##$TD= 32768
##$TD0= 1
##$TE= 0
##$TE2= 300
##$TE3= 300
##$TEG= 300
##$TL= (0..7)
0 120 120 120 120 120 120 120 
##$TP= (0..7)
150 150 150 150 150 150 150 150 
##$TP07= 0
##$TPNAME0= <>
##$TPNAME1= <>
##$TPNAME2= <>
##$TPNAME3= <>
##$TPNAME4= <>
##$TPNAME5= <>
##$TPNAME6= <>
##$TPNAME7= <>
##$TPOAL= (0..7)
0.5 0.5 0.5 0.5 0.5 0.5 0.5 0.5 
##$TPOFFS= (0..7)
0 0 0 0 0 0 0 0 
##$TUNHIN= 0
##$TUNHOUT= 0
##$TUNXOUT= 0
##$USERA1= <user>
##$USERA2= <user>
##$USERA3= <user>
##$USERA4= <user>
##$USERA5= <user>
##$V9= 5
##$VALIST= <valist>
##$VCLIST= <CCCCCCCCCCCCCCC>
##$VD= 0
##$VDLIST= <DDDDDDDDDDDDDDD>
##$VPLIST= <PPPPPPPPPPPPPPP>
##$VTLIST= <TTTTTTTTTTTTTTT>
##$WBST= 1024
##$WBSW= 30
##$XGAIN= (0..3)
0 0 0 0 
##$XL= 0
##$YL= 0
##$YMAX_a= 1763247
##$YMIN_a= -1526890
##$ZGOPTNS= <>
##$ZL1= 120
##$ZL2= 120
##$ZL3= 120
##$ZL4= 120
##$ABSF1= 0
##$ABSF2= 0
##$ABSG= 0
##$ABSL= 0
##$ALPHA= 0
##$AQORDER= 0
##$ASSFAC= 0
##$ASSFACI= 0
##$ASSFACX= 0
##$ASSWID= 0
##$AUNMP= <proc_1d>
##$AZFE= 0.1
##$AZFW= 0.1
##$BCFW= 0
##$BC_mod= 2
##$BYTORDP= 0
##$COROFFS= 0
##$CY= 18.4799938201904
##$DATMOD= 1
##$DC= 0
##$DFILT= <>
##$DTYPP= 0
##$F1P= 9.9274215381318
##$F2P= -0.165520771350173
##$FCOR= 1
##$FTSIZE= 16384
##$FT_mod= 6
##$GAMMA= 0
##$GB= 0
##$INTBC= 1
##$INTSCL= 4.127829e-11
##$ISEN= 128
##$LB= 0.05
##$LEV0= 0
##$LPBIN= 0
##$MAXI= 10000
##$MC2= 0
##$MEAN= 0
##$ME_mod= 0
##$MI= 50
##$NCOEF= 0
##$NC_proc= -5
##$NLEV= 6
##$NOISF1= 3.799351
##$NOISF2= 2.8
##$NSP= 0
##$NTH_PI= 0
##$NZP= 0
##$OFFSET= 16.48848
##$PC= 4
##$PHC0= -263.2463
##$PHC1= 6.301564
##$PH_mod= 1
##$PKNL= yes
##$PPARMOD= 0
##$PSCAL= 4
##$PSIGN= 0
##$REVERSE= no
##$SF= 200.130005582386
##$SI= 16384
##$SIGF1= 3
##$SIGF2= 2
##$SINO= 400
##$SIOLD= 16384
##$SREGLST= <1H.CDCl3>
##$SSB= 0
##$STSI= 16384
##$STSR= 0
##$SW_p= 4139.07284768211
##$SYMM= 0
##$S_DEV= 0
##$TDeff= 32768
##$TDoff= 0
##$TI= <>
##$TILT= no
##$TM1= 0
##$TM2= 0
##$TOPLEV= 0
##$USERP1= <user>
##$USERP2= <user>
##$USERP3= <user>
##$USERP4= <user>
##$USERP5= <user>
##$WDW= 1
##$XDIM= 16384
##$YMAX_p= 350667535
##$YMIN_p= -1318761
$$ End of Bruker specific parameters
$$ ---------------------------------
##NTUPLES= NMR SPECTRUM
##VAR_NAME=  FREQUENCY,     SPECTRUM/REAL,   SPECTRUM/IMAG
##SYMBOL=    X,             R,               I
##VAR_TYPE=  INDEPENDENT,   DEPENDENT,       DEPENDENT
##VAR_FORM=  AFFN,          ASDF,            ASDF
##VAR_DIM=   16384,         16384,           16384
##UNITS=     HZ,            ARBITRARY UNITS, ARBITRARY UNITS
##FACTOR=    0.252644378177508, 1,           1
##FIRST=     3299.83951724647, 0,            0
##LAST=      -839.233330435636, 0,           0
##MIN=       -839.233330435636, -1318761,    0
##MAX=       3299.83951724647, 350667535,    0
$$ Real data points
##PAGE= N=1
##DATA TABLE= (X++(R..R)), XYDATA
$$ [...]
7434A47447j5688q9828K30300j41412J02833k8012r2384N7062M2999j23924O4642
7423A54035l3675j45897J41091m6025M5514J18959j89267R2898k40948K54507
7413A51192j12517O5415P7256L9510j90539r9566K82027l01573K80082k70314
7403g9027J99732m7764O0138p0867j81007L6823p2379J50920k02500L40173j45774
7392a1532P5008j34424J32750q3740J2006j09966K17331j77579J29485r9359L7381
7381a2639p4504o8763k4390J80574j96338P9882M2883Q5631p7390L4911P4636
7370D4493k27454J13106R222J11442j91844J46947l0513n1415j9293P431n3407
7359a41285J34776n3081R561k8129j3901k0416K3923M7523j18348J61176j01406
$$ plain form
7434 147447 131759 41931 272231 130819 233652 205640 113256 170318 213317 89393 154035
7423 154035 120360 -25537 115554 69529 115043 234002 44735 137633 -103315 151192
7413 151192 38675 104090 181346 220856 30317 -69249 212778 -88795 191287 -79027
7403 -79027 120705 72941 133079 62212 -118795 -81972 -154351 -3431 -205931 134242 -11532
7392 -11532 63476 -70948 61802 -21938 -9932 -119898 97433 -80146 49339 -50020 -12639
7381 -12639 -87143 -155906 -180296 278 -196060 -116178 -73295 12336 -65054 -30143 44493
7370 44493 -182961 -69855 -60633 50809 -141035 5912 -24601 -76016 -95309 -87878 -141285
7359 -141285 -6509 -59590 -50029 -78158 -92059 -112475 -88552 -41029 -159377 1799 -99607
7348i9607r4963J37172N6903q070n3097j03545m6750o2112M660K3320K38134p8521
7336h6476k5896j13776K74566k00263J50522k00222K2417J1012M7334L0461K35794
7325A45473j52240j00192k0129k0077J67440j31862J7119j2737O7727j6903l0373
7314h6754n5394J29165k65880K08733N7729j65756k88J22506K5674Q7191j02393
7303d5467O0477R6423k4577k8885N4801q8291j40585L6380L0173m1923p2202J07123
7291e6553j32076J73147k8077J26424k87006J45873j74488K97285l00973J53198
7281h3246J57559R5624k19574P6824j26058J52363k90338K17763j5179j14917
7271a49179K54422k62643K90781j05103o8193J80791k48022K87652j64670R9173
$$ plain form
7348 -99607 -194570 -57398 -495 -8565 -61662 -165207 -211957 -274069 -269409 -246089 -7955 -86476
7336 -86476 -112372 -226148 48418 -151845 -1323 -201545 -179128 -168116 -120782 -90321 145473
7325 145473 -6767 -106959 -127088 -147165 20275 -111587 -94468 -107205 -39478 -56381 -86754
7314 -86754 -142148 -12983 -278863 -70130 -12401 -178157 -178445 -55939 -30265 56926 -45467
7303 -45467 15010 111433 86856 57971 112772 24481 -116104 -79724 -49551 -91474 -163676 -56553
7291 -56553 -188629 -15482 -43559 82865 -204141 -58268 -232756 64529 -236444 -83246
7281 -83246 74313 169937 -49637 27187 -98871 53492 -236846 -19083 -34262 -149179
7271 -149179 105243 -157400 133381 28278 -39915 140876 -107146 180506 15836 115009
7261A15009p2768K40351k42489J02023k9536j64699J34428O8025o407j70161P6457
7250E0233n8693J7333O5874j66150K08351l01276K89794j15834J8703j13812K14050
7239A08573j76227L83070k32352L9298j60922J86870j49344O0147j29263n0378
7229a20528n7385O3696L80089k09564n8886Q0074j93192K24108j62663K5582k45064
7218b73733K42118j12893L29371m43667K98073k79024K80281j24374R2304k96344
7208b87888J08149O8966R5787r1624M5630J78576l70514K64928J9174j76353n3182
7197a98351J63732q1911J38254q1323q1059J64906r8781O4454j36310J68378m1254
7186a9265l122J1145m7897N9305j22585Q8433n878j13715J66748j13792n9951
$$ plain form
7261 115009 42241 282592 40103 142126 112590 -52109 82319 150344 143937 -26224 50233
7250 50233 -8460 8873 74747 -91403 116948 -184328 105466 -10368 8335 -105477 108573
7239 108573 -67654 315416 83064 122362 -38560 148310 -1034 59113 -70150 -120528
7229 -120528 -177913 -114217 265872 56308 -2578 77496 -115696 108412 -54251 -28669 -273733
7218 -273733 -31615 -144508 184863 -258804 39269 -239755 40526 -83848 8456 -287888
7208 -287888 -179739 -110773 -14986 -106610 -60980 117596 -252918 12010 31184 -145169 -198351
7197 -198351 -34619 -116530 21724 -59599 -140658 24248 -74533 -10079 -146389 21989 -19265
7186 -19265 -22387 -11242 -59139 166 -122419 -33986 -39864 -153579 13169 -100623 -160574
7175a60574J76203r8148O3561j62458J26345l4493n7454o8027k3736J55461J41014
7164E7694k4246k84498K49686Q403q3375Q0258n0468m9654Q4663J96178k40905
7153e6264N8351j48641K02211p8986n5624P1986Q3701k86388J49744j15553M14860
7142B39397m79874K65802j49492J80174k60651L06613k66795P3046J55932k19447
7132a55295K94750l29734N0243Q2340O3116j62403K66942j22010J04730j33070
7122d0391J24888O8984j77701P975K1952J22328J35985k38858k1934M0984m1226
7111B986J07267k7847o7538N8724j92860J12104J03614j80702K33746j61398R8926
7100H7022j67260M4946k688P3841r7690K82221j7652k57379K34860l47813M09979
$$ plain form
7175 -160574 15629 -82519 -18958 -181416 -55071 -89564 -147018 -215045 -238781 -83320 57694
7164 57694 33448 -251050 -1364 7039 -76336 3922 -46546 -96200 -11537 184641 -56264
7153 -56264 2087 -146554 55657 -23329 -78953 -6967 76734 -209654 -59910 -175463 239397
7142 239397 -240477 25325 -124167 56007 -204644 101969 -164826 -91780 64152 -155295
7132 -155295 139455 -190279 -140036 -57696 5420 -156983 109959 -12051 92679 -40391
7122 -40391 84497 153481 -24220 -16245 5707 128035 264020 25162 3228 44212 2986
7111 2986 110253 82406 14868 73592 -119268 -7164 96450 -84252 149494 -11904 87022
7100 87022 -80238 -35292 -37980 35861 -61829 220392 202740 -54639 180221 -167592 242387
7089B42387k65743L5635k45828M21749k85396J99429j71404J98412r6632Q5217
7079A17826k3667P2022k0325K11720m41946K36514l29815N2617L26605L6942j69834
7068F8659j61090J42030m1471P0829j4376j03203J16429k71039L33393J03059
7058B43220j02609j67380J50694j40884M4253k9537M8794J06567j73584J63789
7048A43323j09268R9761k18474k5698J43844j1182p4332L6317P9886j24034N8935
7037i22n4123n9539J15657j1849o4644R6160j30257Q9488O7686N333K0707j09163
7025c5466K94627k21840J27446j74288J23079q6056J44815l0424j7916r036j65974
7014e1033J17436J6245j5905R0684K49695l90450K56401k59443J30933j10512
$$ plain form
7089 242387 -23356 12279 -233549 188200 -97196 102233 -69171 129241 32609 117826
7079 117826 94159 166181 145856 357576 -84370 152144 -177671 -125054 201551 238493 68659
7068 68659 -92431 49599 8128 78957 64581 -38622 77807 -193232 140161 243220
7058 243220 140611 -26769 123925 -16959 27294 -2243 46551 153118 -20466 143323
7048 143323 34055 133816 -84658 -110356 33488 22306 -52026 -15709 64177 -59857 -922
7037 -922 -55045 -114584 1073 -10776 -75420 20740 -109517 -20029 47657 52990 73697 -35466
7025 -35466 259161 37321 164767 -9521 113558 27502 172317 141893 123977 114941 -51033
7014 -51033 66403 82648 66743 157427 407122 16672 273073 13630 144563 34051
7004C4051m0369K46973k18475J68480L9937k13115Q1786p3244K9356K75969k49309
6993H2040J48471o9004J67680k97256J69879j76880k8897k2180R4791l7994J69924
6982B00574p4953o4437P239J5723M0344k78336L18471J8551j7881k04545K15417
6971A76167n8982J08281j59417R7367J18257l1480J49748k42196P0688o9650k2905
6960A35878j86476J42135J63657j11984J44376j83823j5163k599J68357o3837
6950A90521J22319j92308m3093j84536L09219k15044J15864j78606K27091j09460
6940D1967Q6554p1946O7732K967o5388J73576j57158j21951J11529J63562q9774
6929A41670J63172n8045K3167p027Q31m24289L39293k20414J20555j47579K09485
$$ plain form
7004 34051 -6318 240655 22180 190660 230597 17482 99268 26024 55380 331349 82040
6993 82040 230511 161507 329187 31931 201810 24930 -3967 -26147 68644 30650 200574
6982 200574 125621 61184 68423 84146 124490 -153846 164625 183176 165295 -39250 176167
6971 176167 117185 225466 66049 163416 281673 250193 399941 157745 228433 158783 135878
6960 135878 -50598 91537 255194 143210 287586 103763 88600 86001 254358 190521
6950 190521 312840 120532 77439 -107097 202122 -12922 102942 -75664 151427 41967
6940 41967 128521 56575 124307 127274 61886 235462 78304 -43647 67882 231444 141670
6929 141670 304842 246797 269964 262937 263768 -160521 178772 -41642 78913 -68666 140819
6918A40819k92j2006j4471j6995M9607j80745J47223k7725n5557K54271j32286
6907A51843L8350l4827L50659k72198n3237J34578r4088Q9270j44790r7218J45983
6896B14325j1275J27551o6979K41664k84013K25495l62670J34000j42128N07041
6886E83011m31184L56272l85056L04372q8438j35165K5230j63149L28667j49583
6876B44977L680J29303k21675J04279j08955J81982j41472J84594k61645J48977
6866B64045n0701J74994j11085L7941l19529N15876l39492K78237k31890J58288
6856C76684j90360K79937j39873r477K5305J39210r437j34847m5658J775j16500
6845A76759P8499J32118J943l4593L5366j5461j17159P0063N3935o4968O0347
$$ plain form
6918 140819 140527 128521 114050 97055 146662 -34083 113140 85415 29858 284129 151843
6907 151843 190193 155366 506025 233827 180590 315168 221080 310350 165560 68342 214325
6896 214325 203050 330601 263622 505286 221273 446768 84098 218098 75970 583011
6886 583011 151827 508099 123043 427415 338977 203812 229042 65893 394560 244977
6876 244977 248657 377960 156285 260564 151609 333591 192119 376713 115068 264045
6866 264045 213344 388338 277253 315194 -4335 511541 172049 450286 218396 376684
6856 376684 186324 466261 326388 316911 342216 481426 471989 337142 291484 293259 176759
6845 176759 255258 387376 389319 354726 390092 374631 257472 327535 381470 316502 376849
6834C76849J7867J02615j85624q748q8515J8154J1129J82835j10851J47963J0358
6823D74032j68380J33395r5023J14764j06048Q6442P5875m3071j53798J98602
6813E16790j70866K69358m00753J88541k79061L41172k75815M86099k22329L1614
6803D84750q7785l8324J83865k10199L0832q2402O1060J6649N8106J16729j71720
6792C61561J64524k34826L49989k34123N8723L5824o9246K8506L1128j30593K94594
6781F56061n3463R4263l49737l1593J7732K668J90736j03130K04849m77496K90105
6770D40995k59451J96579J02075P7951j35840J50120p5634k8412j47750l4309
6760B86324L23167n1111O1882l51502K23012N5284K36891j60895m7388j24442
$$ plain form
6834 376849 394716 497331 311707 302959 214444 232598 243727 426562 315711 463674 474032
6823 474032 305652 439047 344024 458788 352740 439182 515057 471986 318188 516790
6813 516790 345924 615282 214529 403070 124009 465181 189366 675465 453136 484750
6803 484750 396965 358641 542506 332307 363139 280737 341797 358446 416552 533281 361561
6792 361561 526085 291259 641248 407125 465848 501672 432426 460932 492060 361467 656061
6781 656061 602598 696861 347124 315531 333263 335931 526667 423537 628386 150890 440995
6770 440995 181544 378123 480198 558149 422309 572429 496795 468383 320633 286324
6760 286324 609491 558380 620262 268760 491772 547056 783947 623052 575664 451222
6750D51222J4583k974l9837P0381j48810P0545J10902l6282K9977L9947n9418
6739E00236j49385J19969L3850J24496K1481k46138L65608k14154p888j44378
6729D03697L2184k10946L15536k16111P1665K5401j41507J15464L4958L2859j09182
6718C54018p973n4000J63040N4501j35861P3352j6083J75406m8647J43008j21716
6707E79045M3259L4931J92766p9062J00011r011r2784j49818n3783J8082M7193
6696F30829J33799j83087N5951j02338j9423J44405j1377O677k82405Q0070Q1655
6685E34756R0850Q3616J5352P0174n4142L25663R0526k40050K11272J45701j11312
6674A162406M7443k31249o8620n2754J9145k49027M1901L5975m1586J26248j28145
$$ plain form
6750 451222 465805 462831 422994 493375 344565 415110 526012 489730 519707 559654 500236
6739 500236 350851 470820 504670 629166 650647 404509 770117 555963 548075 403697
6729 403697 435881 224935 540471 324360 396025 421426 279919 395383 430341 463200 354018
6718 354018 346045 292045 455085 509586 373725 447077 430994 606400 557753 700761 579045
6707 579045 622304 657235 850001 770939 870950 861939 769155 619337 565554 583636 630829
6696 630829 764628 581541 637492 535154 515731 660136 648759 655436 373031 453101 534756
6685 534756 625606 709222 724574 794748 740606 1066269 1156795 916745 1128017 1273718 1162406
6674 1162406 1209849 978600 909980 857226 876371 627344 669245 705220 663634 789882 661737
6663F61737K56913j73409L7466j38299L74373k08106J7385j68743J63670R301
6653H32288J30540J7014P1458q3971K86889l83084M2992j58941K53644l4081J01002
6642A075750k89723O9437j6509r259l0681J454J3700j79215J03385j5282o1554
6631F61503P4543k27731L24657k05483L19573o9071j26080q1272L8236j41713
6621E67162K17934r9973m4626J11992K4289K15623k01492l0905J16534j68390
6611G08148J98155k22824K89671k32676L49411k37605p7877j15814k1662N144
6601F42071o616Q9965K02241l47787K22367p2844J07076j23722l0773J03807l4743
6590G51042j7301O9570K8026j02786j9457k7957J30071k80872K27740j29200K05689
$$ plain form
6663 661737 918650 745241 782707 644408 1018781 810675 828060 659317 822987 832288
6653 832288 962828 979842 1051300 967329 1254218 871134 914126 755185 1008829 974748 1075750
6642 1075750 786027 855464 838955 829696 799015 800469 814169 634954 738339 723057 661503
6631 661503 736046 508315 832972 627489 947062 877991 751911 670639 708875 567162
6621 567162 785096 685123 640497 752489 776778 992401 790909 760004 876538 708148
6611 708148 906303 683479 973150 740474 1089885 852280 774403 658589 636927 642071
6601 642071 635455 725420 927661 579874 802241 729397 836473 712751 681978 785785 751042
6590 751042 733741 803311 831337 728551 709094 681137 811208 530336 758076 628876 834565
6579H34565k40713J90396l80896K62516q8346J36193n4813p7107j00726J57500
6569F38569K27240j57255J21870k96557K50891l8552q4962P531J185O7813M0338
6558G78111p076j01074r7298K94932k08362J33442r4222K4045R6573k06113K30159
6547H43117p0161J7610P388j10144J68270k3110j0247j01033O9009Q0782n7280
6536H14201J2532j5209M8251j10087l9855J65211j08292O22k2683J18364o9390
6525G93665r0347Q4911O0631j8651k7516k00848j3692R8105O820O6301j30271
6514F29108n7032O8798J52062j94199L1755M3782J3032l3966K2714k3515k0945
6503F31594O26n2915O6012q0791n2906K12169N744o2071N1825j3353k05150J06040
$$ plain form
6579 834565 593852 784248 403352 665868 577522 713715 658902 581795 481069 638569
6569 638569 865809 708554 830424 533867 784758 746206 661244 668775 669960 737773 778111
6558 778111 771035 669961 572663 867595 659233 792675 698453 722498 819071 612958 843117
6547 843117 772956 790566 797954 687810 856080 832970 822723 721690 790699 871481 814201
6536 814201 826733 811524 859775 749688 709833 875044 766752 767374 744691 863055 793665
6525 793665 703318 788229 848860 830209 802693 601845 588153 686258 693078 759379 629108
6514 629108 572076 640874 792936 598737 630492 674274 687306 653340 676054 652539 631594
6503 631594 632220 579305 645317 564526 511620 723789 729533 667462 719287 705934 500784 606824
6491F06824m6853K90618m8721j65441J20118R2335o3340o8351l0450r5352J11795
6480G03182K8909L150l4235j5917P8654m5293J01146k02682j05082l616J11223
6469F19439n785J62203J33446j73217j44422L5568l6256J7374J38455j4922R7799
6458H29682m2731O0730O9173J3306k53175K0258K37925k54120J46616J8855m138
6447H42381m7474P6391P6492o3592n5436j52484J08078J21969j00458k9875l7234
6436G38758K2924j7963K15732l1046j8679N0292J73612k12346J38614j76918m7586
6425H35394j2077J26753J5271k61456m1025N0380J85967q7517P9308k84672J51436
6414G57762p1085j86486K77760j43924K18241l06551M67066j94672K44505j06818
$$ plain form
6491 606824 559971 850589 801868 636427 756545 848880 785540 717189 686739 591387 703182
6480 703182 732091 735241 701006 685089 763743 718450 819596 616914 511832 508216 619439
6469 619439 613654 775857 909303 736086 591664 627232 590976 608350 746805 731883 829682
6458 829682 786951 847681 916854 930160 676985 697243 935168 681048 827664 846519 842381
6447 842381 794907 871298 947790 884198 828762 676278 784356 906325 805867 775992 738758
6436 738758 761682 743719 959451 928405 909726 960018 1133630 921284 1059898 882980 835394
6425 835394 823317 950070 965341 703885 662860 713240 899207 811690 890998 606326 757762
6414 757762 686677 500191 777951 634027 852268 545717 1012783 818111 1062616 955798
6404I55798j13562N2230j39351J48022k58249L3587J76103J22342Q1052j42449
6394I15523J09033j41427L5254M7194m8962R438k98681J50838L7611j57150K20887
6383H79558l0534p4538O3030Q5530N865j31328j08232J00410J64445j3315j2734
6372I28157j37062J7838p089O4302J66390m01971K95708j93712K09451n848j04437
6361H31727j1776r61j21914j9767J18828L8228j10612J79764j96862r474J35152
6350H32333p7250R4601J32771K2377j72647K7864n5786P7769J25726r9941M450
6339I12267j23737J73336l795J10238r2230m9365K4113L0400k29491J89602Q2382
6328A023720k09347M6961J25543k02677Q3809M9562m2747J62464k23297K12344
$$ plain form
6404 955798 842236 894466 755115 903137 644888 678475 854578 976920 1057972 915523
6394 915523 1024556 883129 918383 965577 916615 926053 627372 778210 815821 658671 879558
6383 879558 849024 774486 837516 923046 928911 797583 689351 789761 954206 940891 928157
6372 928157 791095 808933 801844 866146 1032536 630565 926273 732561 942012 936164 831727
6361 831727 819951 818990 697076 677309 796137 834365 723753 903517 706655 697181 832333
6350 832333 755083 849684 982455 1004832 832185 860049 804263 882032 1007758 907817 912267
6339 912267 788530 961866 958071 1068309 976079 926714 950827 981227 751736 941338 1023720
6328 1023720 814373 861334 986877 784200 868009 917571 874824 1037288 813991 1026335
6318A026335j8704l8907o4608J62274k77360J07728j4840N0895K1753q1407j4378
6307H58781K5518r0715J68421J44887j78278O3073j20600P7461j03016N6577p1663
6296H30446J82126J53939k33634K49638r6950J72826k25630J67032j64744O6907
6286A101956r5498m6965J39845r3237o1716q9773K78185J7626M8441m9634q6816
6275A062414Q5088j74501L0127K62702l35641L15959j20532K87896k52770K25869
6265A386611l03265J16745j78734m6679K41176k36087L58595j83548J46854r4163
6255A207505j2913j7877Q6671q2961K77029q8498J36954k08544J81384l49991
6245A128759N8058J5918J9691J50727j92407J64684j19645N8234Q665j20928K38441
$$ plain form
6318 1026335 1007631 968724 904116 1066390 789030 896758 881918 932813 954566 873159 858781
6307 858781 884299 793584 962005 1106892 928614 991687 871087 948548 845532 902109 830446
6296 830446 1012572 1166511 932877 1182515 1085565 1258391 1032761 1199793 1035049 1101956
6286 1101956 1006458 959493 1099338 1006101 944385 854612 1132797 1150423 1198864 1149230 1062414
6275 1062414 1147502 973001 1003128 1265830 930189 1246148 1125616 1413512 1160742 1386611
6265 1386611 1083346 1200091 1021357 974678 1215854 979767 1338362 1154814 1301668 1207505
6255 1207505 1194592 1176715 1263386 1180425 1457454 1368956 1505910 1297366 1478750 1128759
6245 1128759 1186817 1202735 1222426 1373153 1180746 1345430 1225785 1284019 1292684 1171756 1410197
6234A410197o7305J68353l5166q4189O9594k45740J07154K39847j83787J65057
6224A544015k42387J13349L7586J73916j35007n8027l043J71430j09399q5080
6214A407353R6677q7229K81831j48796O6232o6413J20238j89417J43535J00624
6204A724635K9564m8053j27235l7718J18013L962m3303K84384l66584K63205j62186
6193A638684M00968n07142M21116k95697J55411J7761o824j57919J72887l12879
6183A526366L01097Q2997j69670p136q3415k3289N540K32464j50689K2190L2970
6172A769425L7019J17296j14477J16193m9122M7076J24531K28736m71041L63308
6162B168944l78433M83625j91505K26444l11591R9027j32888J18689K7258K93658
$$ plain form
6234 1410197 1342892 1511245 1476079 1391890 1461484 1215744 1322898 1562745 1378958 1544015
6224 1544015 1301628 1414977 1452563 1626479 1491472 1433445 1430402 1601832 1492433 1407353
6214 1407353 1504030 1416801 1698632 1549836 1616068 1549655 1669893 1480476 1624011 1724635
6204 1724635 1754199 1706146 1578911 1541193 1659206 1663168 1619865 1904249 1537665 1800870 1638684
6193 1638684 2039652 1532510 1953626 1657929 1813340 1831101 1824277 1666358 1839245 1526366
6183 1526366 1827463 1910460 1740790 1733654 1650239 1626950 1632490 1864954 1714265 1736455 1769425
6172 1769425 1806444 1923740 1809263 1925456 1876334 1923410 2047941 2276677 1805636 2168944
6162 2168944 1790511 2274136 2082631 2309075 1997484 2096511 1963623 2082312 2109570 2403228
6152B403228p9348l821r4427j01609L01639j04898j33579J28000J63812k10882
6142B268115M25100k43650L8312J49560k66633O4910k6839j05406J80722n1234
6132B432957K29538j40748J89186k61761P4882J7071N2712k9472K9070p7878l4101
6121B481456K15013M9912j71796Q3161J64416q0391J71446j31392l3832J70050
6111B918043M7043j81457K28295j06948p8772J68506k8647l8235j06182K02126
6101C023772L5959k03318N1406J07450K3912k6547J07757Q4134M6539j30980P0471
6090C190555L6226J09539r4963J43651k28050K46391j21864J38624j67677J48495
6080C400927j01962K76251l04375L96530j20447J28621j11591J97864j49102K19387
$$ plain form
6152 2403228 2323880 2320059 2225632 2124023 2425662 2320764 2187185 2315185 2478997 2268115
6142 2268115 2693215 2449565 2487877 2637437 2370804 2435714 2408875 2303469 2484191 2432957
6132 2432957 2662495 2521747 2710933 2449172 2524054 2541125 2593837 2564365 2593435 2515557 2481456
6121 2481456 2696469 2746381 2574585 2657746 2822162 2741771 2913217 2781825 2747993 2918043
6111 2918043 2965086 2783629 3011924 2904976 2826204 2994710 2966063 2927828 2821646 3023772
6101 3023772 3059731 2856413 2907819 3015269 3039181 3012634 3120391 3204525 3251064 3120084 3190555
6090 3190555 3226781 3336320 3241357 3385008 3156958 3403349 3281485 3420109 3252432 3400927
6080 3400927 3298965 3575216 3270841 3667371 3546924 3675545 3563954 3761818 3612716 3832103
6070C832103m3387r1547k6946J13736r5696K79230k18763K27398m9506O7906n4948
6059C939580K78464k78236K60535o5081J4611k4585J35882j48563K32135l8979
6049D305763j6256L38741j32798N1286n9312K87684L375J03044j6705l5768P8131
6038D907185m3755l2408J91187j0765j02198J75717N8697k85902K84665j67596
6028D974827J02524n9857J50926o9818K16826q5472J92949J38891p1835J68471
6018E658432r7322J40997q1239K06696P0498M5310q9638J03470q2845q6099R8866
6007E887126q7412J91619Q0331J35537j54803r2449J79088n2195L76367j89944
5997F273265L37737k62873L42891j48272K35176q9502K32143J7989J58696r629
$$ plain form
6070 3832103 3788716 3697169 3670223 3783959 3688263 3967493 3748730 3976128 3926622 3994528 3939580
6059 3939580 4218044 3939808 4200343 4135262 4149873 4125288 4261170 4112607 4344742 4305763
6049 4305763 4289507 4628248 4495450 4546736 4487424 4775108 4778483 4881527 4864822 4829054 4907185
6038 4907185 4863430 4831022 5022209 5011444 4909246 5084963 5143660 4857758 5142423 4974827
6028 4974827 5077351 5017494 5168420 5098602 5315428 5229956 5422905 5561796 5489961 5658432
6018 5658432 5561110 5702107 5620868 5827564 5898062 5943372 5853734 5957204 5874359 5788260 5887126
6007 5887126 5799714 5991333 6071664 6207201 6052398 5959949 6139037 6086842 6463209 6273265
5997 6273265 6611002 6348129 6691020 6542748 6777924 6688422 6920565 6938554 7097250 7087621
5987G087621J07288P4908j5707Q2054n9137J19200q5528J40313k2124M2244N7188
5976G528320J38550r389p2420J7663R9936K01961N9436Q6399J55799n0441K14864
5965H370678L2199K48822J04169L42399P7002P5029L23449o9828R7903K23049
5955I824871M76194J8528M92752j38045L97468J96056J34259J31671J63388J55460
5945A1852602K68189M50404j53417N18053n8795M20584K71073J96339K65286K87099
5935A4317417L00670N02107L62629M16200L18721L77649L02616M03140N40521
5926A7841670N83370L03284O50435P33478O69027N73604O33937J042484J034023
5917B4065312J022909J021729J037863J351509J327312J679081J576837J922550
$$ plain form
5987 7087621 7194909 7269817 7254110 7336164 7277027 7396227 7310699 7451012 7428888 7471132 7528320
5976 7528320 7666870 7657481 7585061 7602724 7702660 7904621 7964057 8050456 8206255 8155814 8370678
5965 8370678 8402877 8651699 8755868 9098267 9175269 9250298 9573747 9503919 9601822 9824871
5955 9824871 10301065 10319593 10812345 10674300 11071768 11267824 11402083 11533754 11697142 11852602
5945 11852602 12120791 12571195 12417778 12935831 12877036 13297620 13568693 13765032 14030318 14317417
5935 14317417 14618087 15120194 15482823 15899023 16217744 16595393 16898009 17301149 17841670
5926 17841670 18425040 18728324 19378759 20112237 20781264 21354868 21988805 23031289 24065312
5917 24065312 25088221 26109950 27147813 28499322 29826634 31505715 33082552 35005102
5909C5005102J835799K047747J822346J951989J439047J487520O41920J005396
5901D7236866K59673N06392l43859k87822m90675m48801l65857o45381q8330m36229
5891D4895977q5304K775K01763L20199N69593J014384J312914J292078K057699
5882E1582078K137818K878878K872422L220155L343119L657573L095728L110478
5874G5898249K593085J732660J524481L07214k30776j107013j610656j854168
5866G7253076k260868k625775k446100k819765k307335j906304j834031j142524
5858E9910374j064243o09362j04544k41896J91272P14854N27392Q16695J188475
5849F1329017P18302J273058J247427R61640R70040Q96062J65417J33092n39590
$$ plain form
5909 35005102 36840901 38888648 40710994 42662983 44102030 45589550 46231470 47236866
5901 47236866 47496539 48002931 47659072 47371250 46880575 46431774 46065917 45420536 45332206 44895977
5891 44895977 44810673 44813448 45015211 45335410 45905003 46919387 48232301 49524379 51582078
5882 51582078 53719896 56598774 59471196 62691351 66034470 69692043 72787771 75898249
5874 75898249 78491334 80223994 81748475 82055689 81824913 80717900 79107244 77253076
5866 77253076 74992208 72366433 69920333 67100568 64793233 62886929 61052898 59910374
5858 59910374 58846131 58236769 58132225 57890329 58081601 58796455 59323847 60140542 61329017
5849 61329017 62047319 63320377 64567804 65529444 66499484 67395546 67560963 67694055 67154465
5840F7154465k91412j219741r50032j823548j262443j689360j428055j498194
5832E6991680r44739r83465m35195k32615j68758J59488l5492J46636K91444K29512
5822E5018496R6774k94540j49784n13228n12662j187823o25428j330894p63616
5813D9737295j118519j021919p26400r18831l65437o57140Q322j30165P6229J87168
5803D5070603J49111N54828P35378K17803J065053Q70022J019029J051379J340090
5794E2073296Q39207J458619R45825J200015R63988O22522Q29624Q66182O98209
5785F0497487N76343O72975Q68670O03191J017422R65733J368378J385976J545302
5776F9501477J563851J830074K060025K135716K492732K683985K757722L519579
$$ plain form
5840 67154465 66863053 65643312 64693280 62869732 61607289 59917929 58489874 56991680
5832 56991680 56046941 55063476 54628281 54395666 54226908 54386396 54350904 54497540 54788984 55018496
5822 55018496 55115270 54820730 54670946 54157718 53645056 52457233 51831805 50500911 49737295
5813 49737295 48618776 47596857 46870457 45951626 45586189 44929049 44937371 44807206 44883435 45070603
5803 45070603 45219714 45774542 46509920 46727723 47792776 48662798 49681827 50733206 52073296
5794 52073296 52912503 54371122 55316947 56516962 57480950 58103472 58933096 59799278 60497487
5785 60497487 61073830 61746805 62615475 63218666 64236088 65201821 66570199 67956175 69501477
5776 69501477 71065328 72895402 74955427 77091143 79583875 82267860 85025582 88545161
5768H8545161L254357M307720M599698N303624O002503O362648P245848P777460
5760A33399019Q626848Q481944Q740917Q392579P543723N627941L894935J441489
5752A86149395o9819k506270k812499m470770m011641m720960l482240l444940
5744A60630256k410131k045394o74913k20933O46674J674732K821472L185200
5736A63606963M748585N728577O751341Q355954R320231J0755585J2023236J2491158
5728B33781630J2250022J1344250Q820713O016510K696721j142699m801293p909186
5720B61056668j0021989j2102622j3086903j3608271j3176178j2784896j1046503
5713A75229306r632679q016711o527078n043608l564158k003503j111474j71937
$$ plain form
5768 88545161 91799518 96107238 100706936 106010560 112013063 118375711 125621559 133399019
5760 133399019 142025867 150507811 159248728 167641307 175185030 180812971 184707906 186149395
5752 186149395 186079576 183573306 180760807 176290037 172278396 167557436 164075196 160630256
5744 160630256 158220125 156174731 155499818 155278885 155925559 157600291 160421763 163606963
5736 163606963 168355548 174084125 180835466 189191420 198511651 209267236 221290472 233781630
5728 233781630 246031652 257375902 266196615 272213125 274909846 273767147 268965854 261056668
5720 261056668 251034679 238932057 225845154 212236883 199060705 186275809 175229306
5713 175229306 165596627 157579916 151052838 146009230 142445072 140441569 139330095 139158158
5705A39158158Q20261J525971K205002L189783L749064M716278N262295N846045
5697A66472857O021273N754763M625314L121820R72127j094774l799327n832311
5689A76241742p552349q282679q592915q187955p701013o733391n933702n185808
5681A18071930m128452l941590l637859k860152k855201k372964k110828j749526
5673I4415358j310731j140290l73118m15256j59347K80750J79742J57753K41093
5664I1875954l19916o5547l3909m2451j08414L51733M76113O70409J032416J393674
5654I5230062J229662J519301R38185J479949P67428P03470O78071P62845N75559
5645A03884532Q84801J233717J412502J560162K081205K010574K476245J956107
$$ plain form
5705 139158158 139978419 141504390 143709392 146899175 150648239 155364517 160626812 166472857
5697 166472857 172494130 178248893 182874207 185996027 186968154 185873380 182074053 176241742
5689 176241742 168689393 160406714 151813799 143625844 135924831 129191440 123257738 118071930
5681 118071930 113943478 110001888 106364029 103503877 100648676 98275712 96164884 94415358
5673 94415358 93104627 91964337 91591219 91175963 91016616 91297366 91477108 91634861 91875954
5664 91875954 91556038 91490491 91456582 91414131 91305717 91657450 92133563 92803972 93836388 95230062
5654 95230062 96459724 97979025 98917210 100397159 101164587 101868057 102546128 103308973 103884532
5645 103884532 104769333 106003050 107415552 108975714 111056919 113067493 115543738 117499845
5637A17499845J930262J687100J251036Q92648O52335N47954L48591O83453J222646
5628A26715870J629049J946200K777043L671592M295891N017591N330894N779620
5620A57163750N955903O359660O432781O067251N847738N271420M817978M063243
5612B01979724L150789K867951J984060J597917Q63901P29045M69508N79004R26723
5603B15148622R51154J894580K196934L325037L762346M884891N259932O097722
5595B43521218O055522O305719N754371N077482L880717K628399P54261l21056
5587B73656633k360610l875897n069705o364487o612907p080150o970722o901899
5579B28420256o410265n800740n407867m511343m254904l648453l399852k787833
$$ plain form
5637 117499845 119430107 121117207 122368243 123260891 123913226 124461180 124809771 125493224 126715870
5628 126715870 128344919 130291119 133068162 136739754 141035645 146053236 151384130 157163750
5620 157163750 163119653 169479313 175912094 181979345 187827083 193098503 197916481 201979724
5612 201979724 205130513 207998464 209982524 211580441 212444342 213173387 213642895 214221899 215148622
5603 215148622 216099776 217994356 220191290 223516327 227278673 232163564 237423496 243521218
5595 243521218 249576740 255882459 261636830 266714312 270595029 273223428 273977689 273656633
5587 273656633 271296023 267420126 262350421 255985934 249373027 242292877 235322155 228420256
5579 228420256 222009991 216209251 210801384 206290041 202035137 198386684 194986832 192198999
5571A92198999k980091k894412k939725l440601l640853l885476m292362m426664
5563A63698815m598545m333553m479589l619897l242862k043252j590675n67845
5555A39222597O60306J408406K247157K732051L302327K973608K689202J231109
5547A56466763L77445j616617k476617l869950m561533n094808m923665m641352
5539A29659666m215474l364934k547374j370196r09939J30030R47482J734905
5531A20064166K614090L802364N061101N866657P120249Q204804R094636R491628
5523A71319695R877841Q973585Q301205N974503M080629R19854j665679m609211
5515B03172422o435662q553413r513067r908066j0383006r347364q889923p688016
$$ plain form
5571 192198999 189218908 186324496 183384771 179944170 176303317 172417841 168125479 163698815
5563 163698815 159100270 154766717 150287128 146667231 143424369 141381117 139790442 139222597
5555 139222597 139882903 141291309 143538466 146270517 149572844 152546452 155235654 156466763
5547 156466763 156844208 155227591 152750974 148881024 144319491 139224683 134301018 129659666
5539 129659666 125444192 122079258 119531884 118161688 117251749 117381779 118329261 120064166
5531 120064166 122678256 126480620 131541721 137408378 144528627 152733431 161828067 171319695
5523 171319695 181197536 190171121 198472326 204446829 208527458 209447312 207781633 203172422
5515 203172422 196736760 188183347 178670280 168762214 158379208 149031844 140141921 132453905
5507A32453905o920984n687320m615110l845350k363258j842536p79421l10511
5499A06089415Q35649J604253K361739L374040M071224M569071M824224M953239
5491A32682854M132308L193154J068909p16139k958494m903633o554706p620403
5483A18323850q154190q152895p960922p345790o424593n882897m736368m316411
5475F5349784l602066k952176k671008k039676j939931j459326j559343p65207
5467D8361051j308994m85969p09205o39737q7159k42048k46303J37906N1126J25863
5457D4956531L27893N9097N14653J60772M74070L95854M01701L83040M83007K19824
5447D8376442N03793K23524L96566M14437L49454K96695O40415N32772Q04733
$$ plain form
5507 132453905 125532921 119845601 115230491 111385141 109021883 107179347 106399926 106089415
5499 106089415 106925064 108529317 110891056 114265096 118336320 122905391 127729615 132682854
5491 132682854 136815162 140008316 141077225 140361086 137402592 132498959 125944253 118323850
5483 118323850 110169660 102016765 94055843 86710053 80285460 74402563 69666195 65349784
5475 65349784 61747718 58795542 56124534 54084858 52144927 50685601 49126258 48361051
5467 48361051 47052057 46566088 45856883 45217146 45129987 44887939 44641636 44779542 44830668 44956531
5457 44956531 45284424 45343521 45858174 46018946 46493016 46888870 47290571 47673611 48156618 48376442
5447 48376442 48880235 49103759 49500325 49914762 50264216 50560911 51201326 51734098 52538831
5438E2538831M00511P78157O24380P52071Q57279J181713J083133J034751J361316
5429F0612142R64300J257392J135276J197822J216541P21881N18289M24457K38771
5420F8286871j14568j85603p19439j08007r96425k33507r09056m24187m96536
5411F4099543j17064l23304j36868k49943m8901j61745r546l6297j15576l85285
5401F2515014n38961o14807q76991r09972j206891j357850j425304j579818j562951
5392E2441469j811700j543593j529943j473298j158295j329772j393577j117581
5384D1083710j152027r88409r54231j065150q69225p60074j106151p49382q88526
5375C2550535r11652o29149p66140r50319r60821p44300j024123m04712j099320
$$ plain form
5438 52538831 52939342 53717499 54341879 55093950 55951229 57132942 58216075 59250826 60612142
5429 60612142 61576442 62833834 63969110 65166932 66383473 67105354 67623643 68048100 68286871
5420 68286871 68172303 67986700 67267261 67159254 66162829 65929322 65020266 64596079 64099543
5411 64099543 63982479 63659175 63522307 63272364 63223463 63061718 63052172 63015875 62900299 62515014
5401 62515014 61976053 61361246 60484255 59574283 58367392 57009542 55584238 54004420 52441469
5392 52441469 50629769 49086176 47556233 46082935 44924640 43594868 42201291 41083710
5384 41083710 39931683 38943274 37989043 36923893 36054668 35294594 34188443 33439061 32550535
5375 32550535 31638883 31009734 30243594 29293275 28332454 27588154 26564031 26159319 25059999
5366B5059999n09401q23878n57726m05472n90784n83947m61463l32543n31358
5357B0263427m2188l76102k56694l96396j12715j68072l33123j11573m77598R1567
5347A8080533j80275r6264m2161p1175k79252K4114j88776j27791O8143R7723
5337A7284819j83523j4577q1818j9298k18344J0652q7896m2345q5060k44304K35581
5326A6553887J9792k10056j41920J49284K097j74241L06888k06212Q1101J84665
5316A6565285k94364P0963K12952q5474k5182J14267l1571L01589l6448k15911
5306A6576106K15950m7629J27854N564J30195l0426L42826L4435M43117L7815
5296A7835807J41961K75266L18467J13927L43489J47092K68322M12408J50088
$$ plain form
5366 25059999 24550598 23726720 23168994 22763522 22172738 21588791 21127328 20794785 20263427
5357 20263427 20221239 19845137 19588443 19192047 19079332 18911260 18578137 18466564 17988966 18080533
5347 18080533 17900258 17803994 17761833 17690658 17411406 17435520 17246744 17118953 17187096 17284819
5337 17284819 17101296 17086719 17004901 16985603 16767259 16777911 16690015 16647670 16562610 16318306 16553887
5326 16553887 16573679 16363623 16221703 16370987 16373084 16198843 16505731 16299519 16380620 16565285
5316 16565285 16270921 16341884 16554836 16469362 16444180 16558447 16526876 16828465 16792017 16576106
5306 16576106 16792056 16744427 16872281 16877845 17008040 16977614 17320440 17354875 17797992 17835807
5296 17835807 17977768 18253034 18571501 18685428 19028917 19176009 19444331 19856739 20006827
5287B0006827N94614L7636K59603M87831M11969L96677N27243M26766M87779O22462
5277B4259407K75618L34453P30477N88516Q30333P69151N79589Q03342P88301
5268B9959187P33643J153703J030302J104511J353961R25229J626910J447406
5260C9334852J476393J835810J819006K307187K673556K250055L018963K939382
5252E7655204L539454L898499M237291M187749M911549M918733M931864M825134
5244I3105477M723753M434786M350397L717149L800715K773098K749191K294287
5236A21948853K147691K002101K063075J889803K985897K626428L691646L912486
5228A43267980M611401M979492N730973N720239N645213O137570N000309M642764
$$ plain form
5287 20006827 20601441 20639077 20898680 21386511 21798480 22195157 22722400 23149166 23636945 24259407
5277 24259407 24535025 24869478 25599955 26188471 27018804 27787955 28367544 29170886 29959187
5268 29959187 30692830 31846533 32876835 33981346 35335307 36260536 37887446 39334852
5260 39334852 40811245 42647055 44466061 46773248 49446804 51696859 54715822 57655204
5252 57655204 61194658 65093157 69330448 73518197 78429746 83348479 88280343 93105477
5244 93105477 97829230 102264016 106614413 110331562 114132277 116905375 119654566 121948853
5236 121948853 124096544 126098645 128161720 130051523 133037420 135663848 139355494 143267980
5228 143267980 147879381 152858873 158589846 164310085 169955298 176092868 181093177 185735941
5220A85735941L328078J996031K73938j354762l054529m584836n599366o538395
5212A70202100p147563p239705p318149o663269n895948n500745m328084l452239
5204A22656398k936309k100689j333951j027808n39025o94554q61875q02863j430901
5195A10928423j705864k435161l286174l778036m442717m463205n034425n091040
5187H0691801n086203m851053m894074m283949m204130l542353l245922l144911
5179D7439206k530280k298664k173917j991643j785662j659217j251682j447141
5171C2301000j128258j129535q79354j086922q34781o51428r86838l62492r41720
5162B4299672l97113n67943n90554k93774o73780l47139l17040l71459k26110
$$ plain form
5220 185735941 189064019 191060050 191333988 189979226 186924697 182339861 176740495 170202100
5212 170202100 163054537 155814832 148496683 141833414 135937466 130436721 126108637 122656398
5204 122656398 119720089 117619400 116285449 115257641 114718616 114024062 113162187 112359324 110928423
5195 110928423 109222559 106787398 103501224 99723188 95280471 90817266 85782841 80691801
5187 80691801 75605598 70754545 65860471 61576522 57372392 53830039 50584117 47439206
5179 47439206 44908926 42610262 40436345 38444702 36659040 34999823 33748141 32301000
5171 32301000 31172742 30043207 29163853 28076931 27242150 26590722 25603884 25241392 24299672
5162 24299672 23902559 23334616 22744062 22450288 21776508 21429369 21112329 20740870 20514760
5153B0514760m13343l33361k07839l09643m54185N7605m18950j72129l27889j10122
5143A7824904k67343p6836l26289k95136j17621l03360K5526j30441r9036j95588
5133A6038780M3683j77163J08999l68073J16050k54559J27913J45671J65268j38479
5123A5808090J1958k09758N30819l39807N44847n42207O69816K22611L10860M81616
5113A7488845J26330L52919P71353O17845O93089O60869N95665L38426N18698
5104B2164039k01729r2928k23004k96870k62473J11269K39869K26779K17773K74150
5094B2156875N37869P17229K53193O57743O75953P12247Q15099P70703P45864
5085B8042775J159443J045472J254817R26996J652488J621876J773693J421298
$$ plain form
5153 20514760 20101417 19768056 19560217 19250574 18796389 18853994 18435044 18262915 17935026 17824904
5143 17824904 17557561 17480725 17154436 16859300 16741679 16438319 16463845 16333404 16234368 16038780
5133 16038780 16082463 15905300 16014299 15646226 15762276 15507717 15635630 15781301 15946569 15808090
5123 15808090 15820048 15610290 16141109 15801302 16346149 15803942 16473758 16696369 17007229 17488845
5113 17488845 17615175 17968094 18739447 19357292 20050381 20711250 21306915 21645341 22164039
5104 22164039 21962310 21869382 21646378 21349508 21087035 21198304 21438173 21664952 21882725 22156875
5094 22156875 22694744 23411973 23665166 24322909 24998862 25711109 26526208 27296911 28042775
5085 28042775 29202218 30247690 31502507 32429503 34081991 35703867 37477560 38898858
5077C8898858J692979R46457R92182J51481j023927p74481j546682j057420q77423
5068C7402024n77460l31852K33499J81830P80721Q11050R90686J087925J316990
5059D1895413J173180J399057J161557J289241J316333J144830J329754J009759
5051E1719124J430367J242235J281787J492532J332525J160569O07797m85033
5043E9781903r35681j805352j801098k043368j470534j256023m92215P5959J20321
5034E0173912Q19403J019193J219105J524240J387981J714803J516006J614966
5026F0989609J424331J161148J127323J069832J039463J040784J446588J446394
5018G0745472K005565J869549J850809J556815J229756P52293Q09733P36043P52590
$$ plain form
5077 38898858 40591837 41538294 42530476 42681957 41658030 40883549 39336867 38279447 37402024
5068 37402024 36824564 36492712 36726211 36908041 37688762 38499812 39490498 40578423 41895413
5059 41895413 43068593 44467650 45629207 46918448 48234781 49379611 50709365 51719124
5051 51719124 53149491 54391726 55673513 57166045 58498570 59659139 60266936 59781903
5043 59781903 58846222 57040870 55239772 53196404 51725870 50469847 49977632 50053591 50173912
5034 50173912 50993315 52012508 53231613 54755853 56143834 57858637 59374643 60989609
5026 60989609 62413940 63575088 64702411 65772243 66811706 67852490 69299078 70745472
5018 70745472 72751037 74620586 76471395 78028210 79257966 80010259 80819992 81556035 82308625
5009H2308625J255808P92233R01295L74037R7842o03144m48853p35223R1789L38929
4999H4373338R45973J268675J404996J454200J846234J640951J616266J593424
4991I6144057J756997K280565K806899L236093L637569M137963M256023N057473
4983A23313639M977405M822756M873327M648250L714060L318177K050247O16807
4975A52334668j418504k775307m384678m668971m917910m169988l397677k415880
4967A24185753k020310r11634l92874J21521P88768Q24495J683314J486870K697354
4958A28463257K854907M156292M281274N078815N243305N596374N445345M923969
4950A66043538M045728L022362J603696j67155k408311m126322o344302p590960
$$ plain form
5009 82308625 83564433 84356666 85257961 85631998 85729840 85126696 84677843 83942620 84034409 84373338
4999 84373338 85319311 86587986 87992982 89447182 91293416 92934367 94550633 96144057
4991 96144057 97901054 100181619 102988518 106224611 109862180 114000143 118256166 123313639
4983 123313639 128291044 133113800 137987127 142635377 146349437 149667614 151717861 152334668
4975 152334668 150916164 148140857 143756179 139087208 134169298 129999310 126601633 124185753
4967 124185753 122165443 121253809 120860935 120982456 121771224 122595719 124279033 125765903 128463257
4958 128463257 131318164 135474456 139755730 144834545 150077850 155674224 161119569 166043538
4950 166043538 170089266 173111628 174715324 174548169 172139858 168013536 161669234 154078274
4942A54078274q330172q274774p693308o993184n608050m934112l636690k836485
4934A05771499j898281j292479r69238o44881l68062j31462K991Q83679J031695
4925A02385461J888677K477811K973740L215747K717124K007564L89254j055596
4917A16999782k311655l996824m936695n913128o362258o342315n834345n790537
4909G5512025m517824m457513l079623k943097k427568k039444j768692j804362
4901E2473902j555786j225274j356834r89061j149671o93160n08393k18546m57938
4892D4319239J56294K12153k8822L32160j47793o78983p33447j668158j799337
4883C9963306k163559k322659k315187k006766j594349j652031j047308j298606
$$ plain form
4942 154078274 145748102 137473328 129780020 122786836 117178786 112244674 108607984 105771499
4934 105771499 103873218 102580739 101611501 100966620 100598558 100467096 100470087 101353766 102385461
4925 102385461 104274138 106751949 109725689 112941436 115658560 117666124 118055378 116999782
4917 116999782 114688127 110691303 105754608 99841480 93479222 87136907 81302562 75512025
4909 75512025 70994201 66536688 63457065 60513968 58086400 56046956 54278264 52473902
4901 52473902 50918116 49692842 48336008 47346947 46197276 45504116 44995723 44777177 44319239
4892 44319239 44475533 44687686 44658864 44991024 44843231 44164248 43430801 41762643 39963306
4883 39963306 37799747 35477088 33161901 31155135 29560786 27908755 26861447 25562841
4875B5562841o95608r85461n73406r75830l53582p78478l57972m81128l00833
4866B0060543o54536r1206m36824j22015l86220k41020k59613j22329k49044o5924
4856A7431812M8686o28694K17315k62025l5709k67505l2480m8152N8075r0740
4846A6390583K6790R0627l37915J35530j62585R1857j26291R95J08293j73012
4836A6044872J30451Q7426J34438J02181j17724R509J19068j58525J21676Q2454
4826A6555826K22718k1536P5720P1411J65770k0834J13817J92916Q4917K10690
4816A7651415Q1028J25563K38259J81522J96899K293K64637Q0706N71304l4497
4806A9359129K86093L60985K40487L66338J31913K03659J8146O70858m5156O12326
$$ plain form
4875 25562841 24867233 23881772 23308366 22332536 21978954 21200476 20842504 20361376 20060543
4866 20060543 19406007 19314801 18877977 18755962 18369742 18128722 17869109 17746780 17497736 17431812
4856 17431812 17480498 16851804 17069119 16807094 16771385 16503880 16471400 16423248 16481323 16390583
4846 16390583 16417373 16508000 16170085 16305615 16143030 16234887 16108596 16109591 16217884 16044872
4836 16044872 16175323 16262749 16397187 16499368 16381644 16391153 16510221 16351696 16473372 16555826
4826 16555826 16778544 16757008 16832728 16904139 17069909 17049075 17162892 17355808 17440725 17651415
4816 17651415 17732443 17858006 18096265 18277787 18474686 18476979 18741616 18822322 19393626 19359129
4806 19359129 19645222 20006207 20246694 20613032 20744945 20948604 20966750 21637608 21592452 22204778
4796B2204778K26506M57987K79184K21176L17218K70307M38896K04001Q01716
4787B5421769R5466P25193K96256M25827M53532P08161M64330Q43139L35533O40843
4777C0410049Q62075N53803J014514P39907Q19397Q84910Q40673R93576R79673
4768C8098577R46160J082646J075247J116843J209974J251914J322764J152771
4760D7256896J658691J239401J905434J327343J792490J577786J891564K013292
4752F0662897K008577K146719K147461K103390K220106K562118K787110K777113
4744G9415491L485416L416850M106970M274959N101895N573669O158112N962950
4736A17496312O032534N913159M909334M984556M609126N237412N271108O091603
$$ plain form
4796 22204778 22431284 22889271 23168455 23389631 23706849 23977156 24416052 24620053 25421769
4787 25421769 25517235 26242428 26538684 26964511 27418043 28126204 28590534 29433673 29769206 30410049
4777 30410049 31272124 31825927 32840441 33580348 34399745 35284655 36125328 37118904 38098577
4768 38098577 39044737 40127383 41202630 42319473 43529447 44781361 46104125 47256896
4760 47256896 48915587 50154988 52060422 53387765 55180255 56758041 58649605 60662897
4752 60662897 62671474 64818193 66965654 69069044 71289150 73851268 76638378 79415491
4744 79415491 82900907 86317757 90424727 94699686 99801581 105375250 111533362 117496312
4736 117496312 123528846 129442005 134351339 139335895 143945021 149182433 154453541 160545144
4728A60545144O272242O772501O834315O855478O830998O552725O249248N639095
4720B12551746N454579M119613M250045L597828M166714M656278O002027P548158
4712B52346988R033349R461485Q344705N822416K678011m000j439463j326047
4704B84917444p06380O45195J913129L591610M051539N084424M638407M492210
4696C08627578L047838J788731M6891j474069k816324k977081l601370k750414
4688B99891780k274318q89592k21971J004635J472995K147956K749724L097085
4680C06978294M011956M604848N842767O413028O534507N954623N167150L542851
4672C49050024J538087P9424j903708k501686l524049l503512l792485l258227
$$ plain form
4728 160545144 166817386 173589887 180424202 187279680 194110678 200663403 206912651 212551746
4720 212551746 218006325 222125938 226375983 229973811 234140525 238796803 244798830 252346988
4712 252346988 261380337 270841822 279186527 285008943 287686954 287682954 286243491 284917444
4704 284917444 284211064 284856259 286769388 290360998 294412537 299496961 304135368 308627578
4696 308627578 311675416 313464147 313511038 312036969 309220645 306243564 302642194 299891780
4688 299891780 297617462 296727870 296505899 297510534 298983529 301131485 303881209 306978294
4680 306978294 310990250 315595098 321437865 327850893 334385400 340340023 345507173 349050024
4672 349050024 350588111 350667535 348763827 346262141 342738092 339234580 335442095 332183868
4664C32183868l369898l051980k955356k854287k537816k626974k556270j608543
4656C10622744k047833j146703j414384j266963j693547k539633m321456o282979
4648B89909246q667000j0301821j2019901j2328295j2478266j1572603j0695130
4641B11846230r708405q539357p466893o445770n999396n230623m804827m284396
4633A59366563l974132l773302l359544l584572l091032l491428l426413m059559
4625A30606581m620516m587089n153187m980941m989807l761719m354856l361800
4617I4796666m195612l199271l652319l034729k804947k707503k487611k262042
4609G0452632j888314j822907j277154j370419j394135j133250j752487j260186
$$ plain form
4664 332183868 328813970 325761990 322806634 319952347 317414531 314787557 312231287 310622744
4656 310622744 308574911 307428208 306013824 304746861 303053314 300513681 296192225 289909246
4648 289909246 281242246 270940425 258920524 246592229 234113963 222541360 211846230
4641 211846230 202137825 193598468 186131575 179685805 173686409 168455786 163650959 159366563
4633 159366563 155392431 151619129 148259585 144675013 141583981 138092553 134666140 130606581
4625 130606581 125986065 121398976 116245789 111264848 106275041 102513322 98158466 94796666
4617 94796666 90601054 87401783 83749464 80714735 77909788 75202285 72714674 70452632
4609 70452632 68564318 66741411 65464257 64093838 62699703 61566453 59813966 58553780
4601E8553780j695960k022115j958001j868389j817167j584539j901736j732638
4593D3973235j338010j581487j393668j458515j405885j560940q88192j248411
4585C3098127r92395j234529j231101j109524j108203j170582q24327j319547
4577B4107919n99587q56157p93311o70342o95971n42724p63527l93050m57108
4568A8336142m10920o19982j69947n79303k45809n73434m82187k96449J959n89127
4558A4370943q0490m72366o1955o15734P0488o92680r4374k44348J68791m42707
4548A1905568k43649k05226j14886j34596l05334P1929m08153q9825L9700k76837
4538A0238691k49590k32259n8004l70165l37366J78506p5942l13000k60849K0483
$$ plain form
4601 58553780 56857820 54835705 52877704 51009315 49192148 47607609 45705873 43973235
4593 43973235 42635225 41053738 39660070 38201555 36795670 35234730 34346538 33098127
4585 33098127 32105732 30871203 29640102 28530578 27422375 26251793 25427466 24107919
4577 24107919 23508332 22652175 21858864 21188522 20492551 19949827 19186300 18793250 18336142
4568 18336142 17925222 17305240 17135293 16555990 16310181 15736747 15254560 14958111 14960070 14370943
4558 14370943 14290453 13818087 13756132 13140398 13210886 12518206 12423832 12179484 12348275 11905568
4548 11905568 11661919 11456693 11341807 11207211 10901877 10973806 10565653 10475828 10515528 10238691
4538 10238691 9989101 9756842 9698838 9328673 8991307 9169813 9093871 8780871 8520022 8540505
4528H540505k11987k40079j7751j82328r0171j703j84192r0375K9275l65257J66850
4517G352787l20134P1706j24951J40844m18790K42669k56392m2713k75954J3783
4507F382855j86696j3758N4631K3780k71732j58292P1777N3126j7106k58527J92454
4496E872512k22747J43480j59634M7172k51892N9243j23849R83J2506r0996L7249
4485E324027o0606P9825j40713J16088r7958m8153R3060M5878J9254r5505k3634
4474E211563k9798k6217K1373l18739o249o4948j91659P6537j94488K4887R683
4463D511945j92177j2956j86337L3536J34289j35563j27194l3117J26275j45125
4453C973576J26428O8823j2662q4018j00968K60606k10079l3329M3570j22909
$$ plain form
4528 8540505 8328518 8088439 8070688 7888360 7798189 7796486 7612294 7521919 7551194 7185937 7352787
4517 7352787 7032653 7104359 6979408 7120252 6701462 6944131 6687739 6645026 6369072 6382855
4507 6382855 6196159 6182401 6237032 6260812 5989080 5830788 5902565 5955691 5938585 5680058 5872512
4496 5872512 5649765 5793245 5633611 5680783 5428891 5488134 5364285 5365268 5377774 5286778 5324027
4485 5324027 5263421 5343246 5202533 5318621 5220663 5172510 5265570 5311448 5330702 5235197 5211563
4474 5211563 5181765 5155548 5176921 4858182 4851933 4786985 4595326 4671863 4477375 4502262 4511945
4463 4511945 4319768 4306812 4120475 4154011 4288300 4152737 4025543 3992426 4118701 3973576
4453 3973576 4100004 4168827 4156165 4072147 3971179 4231785 4021706 3988377 4031947 3909038
4443C909038j56771J79950j28597P6376K7974l10912K04069j42680L07292k07190
4433C758549p6525J406J53870j67989Q2837k24765J33246j41528j6802J77700
4423C679999k54943m8660Q6030r8491J8983j82759K4760j56365J69321j90086
4413C047789K73841K4071j45680q1636j20605J04605p3649J10015j79990m902
4403B953859J53060k53837K78493l65514K55640j33398j9366k83843N7679R2444
4393B735217j97745J11187O514k30690R5295o5149P5241j99275J49089j69374
4383B310310K19242j12806L51213k51584J08424r8428K6117o8369J34018j13316
4373B504821K52260m62220j16596R4140j54614k62250K5686j13846j69294L44887
$$ plain form
4443 3909038 3752267 3932217 3803620 3879996 3907970 3597058 3801127 3658447 3965739 3758549
4433 3758549 3682024 3683430 3837300 3669311 3752148 3527383 3660629 3519101 3502299 3679999
4423 3679999 3425056 3376396 3462426 3363935 3382918 3200159 3224919 3068554 3237875 3047789
4413 3047789 3321630 3345701 3200021 3118385 2997780 3102385 3028736 3138751 2958761 2953859
4403 2953859 3106919 2853082 3131575 2766061 3021701 2888303 2868937 2585094 2642773 2735217
4393 2735217 2537472 2648659 2655173 2424483 2519778 2454629 2529870 2330595 2479684 2310310
4383 2310310 2529552 2416746 2767959 2516375 2624799 2526371 2552488 2484119 2618137 2504821
4373 2504821 2757081 2294861 2178265 2272405 2117791 1855541 1881227 1767381 1598087 1942974
4363A942974j02163R0288r0310j53494Q3610p4739j24594L61221j24051Q6005
4353A894747j42044K53913M8066m466j46009O35263Q1514K5780j2888m17031q8360
4342B128485k22131j18901J3857k65851J24874r9085K2031k49539K04304q3872
4332A454172n4202q5781N3577o2512Q6371r1877k20521M3867J46339q8326k703
4321A178404K08085J20654M8908K10638j91946j31345K5204O116j8420j45092
4311A311206m6424n2718r6360m986j4665P1534k28067R0753J8627k27450K40365
4300A061815L0291p0200r1923M801P1761q8896J21436j86834L17573o5242J19468
4289A224050m7908K5926l4084k9752o0585J20473j7055J78411j19313J6083J52312
$$ plain form
4363 1942974 1840811 1931099 1840789 1687295 1770905 1696166 1571572 1932793 1808742 1894747
4353 1894747 1752703 2006616 2054682 2050216 1904207 2539470 2620984 2646764 2633876 2216845 2128485
4342 2128485 1906354 1787453 1801310 1535459 1660333 1561248 1583279 1333740 1538044 1454172
4332 1454172 1399970 1314189 1367766 1305254 1391625 1299748 1079227 1123094 1269433 1181107 1178404
4321 1178404 1386489 1507143 1556051 1766689 1574743 1443398 1468602 1474718 1456298 1311206
4311 1311206 1264782 1212064 1115704 1110718 1096053 1167587 939520 1030273 1048900 821450 1061815
4300 1061815 1092106 1021906 929983 934784 1006545 917649 1039085 852251 1169824 1104582 1224050
4289 1224050 1176142 1202068 1167984 1138232 1077647 1198120 1181065 1359476 1240163 1256246 1408558
4278A408558m3963p9474K39656k58000J32416k15097J51176j99191N17077l31960
4268A321198L49712k56016J55248K6850J17838q6989J63138j4131j56969J73706
4258A793585J41000J7345j76352O3831J38575n4649J12118K0992j35479J61256
4248B082222J71691J47729k62376K77803k57322K93247M7668l594J42882k3979
4238B615971m3671K86627N1896L8094j36874K80930k6769K10600o8267j51628
4228C056909K74708J85344n7829J48858R507J16209K23409R5010J21848M42095
4218D616068j04675K57935L43990P1308M57455K14420L23947M31394L33608O95541
4208G640991O98255L65765R05944O03246O88301P13902M44086l824O0905q43565
$$ plain form
4278 1408558 1364595 1285121 1524777 1266777 1399193 1184096 1335272 1136081 1653158 1321198
4268 1321198 1670910 1414894 1570142 1596992 1714830 1627841 1790979 1776848 1619879 1793585
4258 1793585 1934585 1951930 1775578 1839409 1977984 1923335 2035453 2056445 1920966 2082222
4248 2082222 2253913 2401642 2139266 2417069 2159747 2452994 2500662 2497068 2639950 2615971
4238 2615971 2572300 2858927 2910823 2948917 2812043 3092973 3066204 3276804 3208537 3056909
4228 3056909 3331617 3516961 3459132 3607990 3617497 3733706 3957115 4052125 4173973 4616068
4218 4616068 4511393 4769328 5113318 5184626 5642081 5856501 6180448 6611842 6945450 7640991
4208 7640991 8339246 8705011 9610955 10214201 10902502 11616404 12060490 12056666 12117571 11274006
4198A1274006o10932n16405p38178m38885m99824m48515o52158k56428o65335
4189F447346n37399m73143n18307o32317k28043n21766m32772L6085l76194k64695
4179B498795Q3202m05358m0053k01465L3593k24156m9321j93350J50197j21688
4169A530396j6978k77301K21579j44893l42126K00251P6211k80392q9821P1732
4159I48658j50605K9312n1079J4718q1952J88511j10089O1772k73389m3598J4250
4148E46509K1666j60647K484j18134K10266M7863p7366q6254j33567J50118k13011
4137A89927K00944q4675R5974l36200L36523k88083P2369M3552M5712J15331j57485
4126B33889o8934r2284J03454k76388L51849O7570k93889R892J34718k8235O1657
$$ plain form
4198 11274006 10663074 10146669 9408491 8969606 8469782 8021267 7369109 7112681 6447346
4189 6447346 5909947 5436804 4918497 4286180 4058137 3536371 3103599 3139684 2763490 2498795
4179 2498795 2581997 2176639 2136586 1935121 1968714 1744558 1695237 1501887 1652084 1530396
4169 1530396 1513418 1236117 1457696 1312803 970677 1170928 1247139 966747 876926 948658
4159 948658 798053 827365 776286 791004 709052 897563 787474 849246 575857 532259 546509
4148 546509 568175 407528 410012 291878 502144 550007 472641 386387 252820 402938 189927
4137 189927 390871 306196 402170 65970 402493 114410 186779 230331 276043 391374 233889
4126 233889 164955 72671 176125 -100263 251586 319156 25267 35159 169877 141642 203299
4115B03299j56527j5353J70668l01344J09228r1201Q0486p6416J54282m7558R0449
4104A20013k40779O8411J2649J01654j93690J37862j7116R8694j34302p3289K40421
4093A20528j01173J2449K4079n3669k05915L2375R8280L9304r4260j31773M9193
4082b10582K5343j29930J16329j69406J07378l9222L12744k26533M7399k01447
4072c67927K72338r7864k1086P5547j10710J90609j61857J9762P6544m97556M13069
4061b09131j90941R2218j64960J52509j3688P6434J68490r4750m9877N8986r4064
4050b68774r078j06146Q2p671n1962K0671M8361j97093L52747r9981o8232q473
4038c95549o0736M2431l1376O2703j84927M14643l93601K32547j66357J77738
$$ plain form
4115 203299 46772 31419 202087 -99257 9971 -81230 -744 -77160 77122 29564 120013
4104 120013 -120766 -52355 -39706 61948 -131742 6120 -10996 87698 -46604 -119893 120528
4093 120528 19355 31804 55883 2214 -203701 -171326 -73046 -33742 -128002 -259775 -210582
4082 -210582 -185239 -315169 -198840 -368246 -260868 -300090 12654 -213879 -166480 -367927
4072 -367927 -95589 -193453 -214539 -138992 -249702 -59093 -220950 -201188 -124644 -622200 -209131
4061 -209131 -400072 -307854 -472814 -320305 -333993 -257559 -89069 -183819 -233696 -174710 -268774
4050 -268774 -277852 -383998 -383916 -391587 -443549 -422878 -374517 -571610 -218863 -318844 -387076 -395549
4038 -395549 -456285 -413854 -445230 -382527 -567454 -152811 -546412 -313865 -480222 -302484
4028c02484j68166J94567j48593J58236l13861L2611J10660o2670K35973l36656
4018f00383J38379r9728P5862K21784j06123r4027J28366q4541J10193j58503
4008d68721o0822K53581J55555K9500l09064J56262j33935R5545l06848K34835
3998c54112J19368j03187J17310r9838L2720j19109j18598K21434k33276O9605
3988d67683K20182l1373l8116Q3010j21071J32538k263L9938J04695j63706K319
3977b41530j2104K34125m14117K47647j03750Q6889J2855k0307j369K00114q4995
3966i6542J681o5090j68984J20855n2511J49572q6287Q8371j41887P3756q3517
3955b60583m0642O2608J08735j26178O6445K13452k62037J5859j10189J20484
$$ plain form
4028 -302484 -470650 -276083 -424676 -266440 -580301 -547690 -437030 -499700 -263727 -600383
4018 -600383 -462004 -561732 -485870 -264086 -370209 -464236 -335870 -420411 -310218 -468721
4008 -468721 -529543 -275962 -120407 -90907 -399971 -243709 -377644 -282099 -588947 -354112
3998 -354112 -234744 -337931 -220621 -320459 -287739 -406848 -525446 -304012 -537288 -467683
3988 -467683 -247501 -278874 -316990 -233980 -355051 -222513 -224776 -184838 -80143 -243849 -241530
3977 -241530 -253634 -19509 -433626 -185979 -289729 -202840 -189985 -210292 -211661 -11547 -96542
3966 -96542 -94861 -159951 -328935 -208080 -260591 -111019 -197306 -108935 -250822 -177066 -260583
3955 -260583 -301225 -238617 -129882 -256060 -189615 23837 -238200 -222341 -332530 -212046
3945b12046l3257N6786J65742j09915J72246M3182K6928j22968O9564r9653J71036
3934A27645j19092J16404n5766J23508j42848K28291j17108K24580p1198j24514
3924A89902J27819l643k9834J04553P9732j96262K18501q9679J9584l2539J35982
3913E24116k43719N60514l83414K00688M4368K5191K28214q0410Q3922K24449
3903A183919J77021j24632P0779j10066K26387k12254M5739j66295k95471J08491
3893I03618o2163l0040j39368j33465j08852K67916j38385k1530j62743O9690
3883D44678J09102J14311m030J0438p4067J58115k04352L10042m61809J94947
3873E97375k24376L47223l58012K80057l22639N6227l08694M17551k39196R4750
$$ plain form
3945 -212046 -245303 -188517 -22775 -132690 39556 82738 109666 -13302 56262 -43391 127645
3934 127645 8553 124957 69191 192699 49851 278142 161034 385614 314416 189902
3924 189902 317721 314078 284244 388797 468529 272267 490768 401089 420673 388134 524116
3913 524116 280397 840911 457497 658185 702553 727744 955958 875548 959470 1183919
3903 1183919 1360940 1236308 1307087 1197021 1423408 1211154 1256893 1090598 795127 903618
3893 903618 841455 811415 672047 538582 429730 697646 559261 537731 374988 444678
3883 444678 553780 668091 664061 674499 600432 758547 554195 864237 402428 597375
3873 597375 372999 720222 362210 642267 319628 375855 67161 484712 245516 340266
3863C40266m12996K53712n6572n4813p4046j48093J42726J627Q3532k86316j34076
3852c45049J09716o1378K5448p4910J28098k0704p487l3427J5348j21644k1866
3841d07855L9454O6625j3491K1417j36906J59381r6803J63935l39121K6519O1498
3830d55347k4457J01579j67721Q4043j1634M4223j32124J37708j55346J8307N103
3819e55666R4608k062j49995Q9369n9880r9785K90080j20660j79799J09138k90968
3808h75620L30686J4082j53158J73142L5746j07141J8067m4570p9948K75786k96972
3797g09900J55675K02316j91864n9635K294k46906K46251k27299J83483j3192
3787f58777K9829R887K20151j87040j82543J21059j16381K1487J31443r6298K39378
$$ plain form
3863 340266 -72730 180982 124410 69597 -4449 -152542 -9816 -8189 75343 -210973 -345049
3852 -345049 -235333 -296711 -271263 -346173 -218075 -238779 -246266 -279693 -264345 -385989 -407855
3841 -407855 -368401 -301776 -315267 -293850 -430756 -271375 -368178 -204243 -543364 -516845 -455347
3830 -455347 -479804 -378225 -545946 -461903 -473537 -429314 -561438 -423730 -579076 -560769 -555666
3819 -555666 -461058 -463120 -613115 -523746 -583626 -683411 -393331 -513991 -693790 -584652 -875620
3808 -875620 -544934 -530852 -684010 -510868 -475122 -582263 -564196 -608766 -688714 -412928 -709900
3797 -709900 -554225 -351909 -543773 -603408 -601114 -848020 -601769 -829068 -645585 -658777
3787 -658777 -628948 -619061 -398910 -585950 -768493 -647434 -763815 -742328 -610885 -707183 -467805
3776d67805j76241m4833r2046Q3930j17679J33926j4387r4995K05116K3888J89099
3765c72027l17275P1277l4520k6751p9795K2745k9600L6162J3127K27208j51671
3754f41120P3646j22328o363P5226O0560j35912j22471K12277p0647K78329P537
3743c91266k15374J31423k81451J47398j24031J6570l436J06143n6738p3966J50327
3732e94401j39492J04059n1244M6808k4962P8860j81308K72291k37382K46630
3722d80141j30500J04844l15236K18031R43K9254j47146R8493j28993R8101o2438
3711g14788R6841j56756P057J05737k50714R1141r6644L14990l29463J97611o0762
3700g95750J63360k11797K18329q4410J39945k24296o0529K37691j74104n148
$$ plain form
3776 -467805 -644046 -688879 -780925 -696995 -814674 -680748 -695135 -790130 -585014 -561126 -372027
3765 -372027 -689302 -618025 -652545 -679296 -759091 -736346 -765946 -729784 -716657 -489449 -641120
3754 -641120 -567474 -689802 -696165 -620939 -560379 -696291 -818762 -606485 -677132 -398803 -391266
3743 -391266 -606640 -475217 -756668 -609270 -733301 -716731 -720167 -614024 -670762 -744728 -594401
3732 -594401 -733893 -629834 -681078 -634270 -659232 -580372 -761680 -489389 -726771 -480141
3722 -480141 -610641 -505797 -821033 -603002 -602059 -572805 -719951 -621458 -750451 -652350 -714788
3711 -714788 -617947 -774703 -767646 -661909 -912623 -821482 -918126 -603136 -932599 -734988 -795750
3700 -795750 -632390 -844187 -625858 -710268 -570323 -794619 -855148 -617457 -791561 -796709
3690g96709j94J24435r5119K23822j53164P9155j53613N6319m3863K216M2186
3679g14529R9039R6436p4079k5783J25461j36710j58741J56716j4477k7772M6710
3668f27729N056J08618p7172J65997m53043M40285j84287j5464K9599K8712j1806
3657e91234P4828q5566r3185K70298m01636L54489j66042k12860J77786R593j88578
3646h52107J28417K09101j38378k7683K8909p4865l1497r8387J23483r643J05946
3635f36704M1924R0021L9250k91638K09174j26296m4313M6626J3648q1726J9771
3624g20263m7020J52648j371j80298L6985j1150M4511n0354J00890k09032L87892
3613d96562l06783K80744k74327J30750j67894K21025j71181N6626r3906K68572
$$ plain form
3690 -796709 -796903 -672468 -767587 -543765 -696929 -617774 -771387 -715068 -758931 -756715 -714529
3679 -714529 -615490 -519054 -593133 -618916 -493455 -630165 -788906 -632190 -646667 -674439 -627729
3668 -627729 -622673 -514055 -591227 -425230 -878273 -437988 -622275 -637739 -608140 -579428 -591234
3657 -591234 -516406 -601972 -695157 -424859 -826495 -472006 -638048 -850908 -673122 -663529 -852107
3646 -852107 -723690 -514589 -652967 -680650 -651741 -726606 -758103 -856490 -733007 -742650 -636704
3635 -636704 -594780 -504759 -465509 -757147 -547973 -674269 -718582 -671956 -658308 -740034 -720263
3624 -720263 -767283 -614635 -616006 -796304 -759319 -770469 -725958 -776312 -675422 -884454 -496562
3613 -496562 -803345 -522601 -796928 -666178 -834072 -613047 -784228 -727602 -821508 -552936
3603e52936j78298Q5827j47523P1927j95585L81644l54189M80133m10587K24615
3593e94972k82409L45127l18723K37316q6673K2541n1509K09369j58941R6053
3583e82821J1555j56579J38220l31125J35869J06454J14094q2157p2072N286l1084
3572g44360J05162r6035L11666k10255J45679o5745j47163K41713j68280j69933
3562g97551K55223k73717J27129l2084L8717m3196P0992q7107P7835P1581k65238
3551h57416K52482l2973j11027J25250N0658j19173P3858k77921K34347n8140
3541g20055m3353J9210P627j34988K66424p8822K6886j98147J32275M9852N6852
3530f16239L4776j51349K76668m05527J63425o6236K02791l76544K08771J8444
$$ plain form
3603 -552936 -731234 -645407 -792930 -721003 -916588 -534944 -889133 -409000 -819587 -594972
3593 -594972 -877381 -532254 -850977 -613661 -700334 -677793 -729302 -519933 -678874 -582821
3583 -582821 -571266 -727845 -589625 -920750 -784881 -678427 -564333 -646490 -718562 -713276 -744360
3572 -744360 -639198 -735233 -423567 -633822 -488143 -553888 -701051 -459338 -627618 -797551
3562 -797551 -542328 -816045 -688916 -721000 -682283 -725479 -654487 -741594 -663759 -592178 -857416
3551 -857416 -604934 -637907 -748934 -623684 -573026 -692199 -618341 -896262 -661915 -720055
3541 -720055 -763408 -744198 -736571 -871559 -605135 -683957 -657071 -855218 -722943 -673091 -616239
3530 -616239 -581463 -732812 -456144 -861671 -698246 -764482 -561691 -938235 -729464 -711020
3520g11020J7356j02475L8169L8004q1390R3470k4307K47772k52109k628P0284
3509f68874k1200j03516p3120K05979k6789J86556j57332J88111l45793K49694
3499e66284k33145J85415j29614o7217n9284J28979q8439J54013j07384O0873
3489g22087m2912J98915p1796O8987k46780J85181l5443k5897p2787j20459K31819
3478f53259q5139M1863Q6100j83262J42395K4344J16573j7579k65380N390K15396
3467e72558J02178k06862k3574O4483k9026P9372N6509K9426k28593J2374o8670
3456g84941L5828R0532k30268Q0727K67694k00463J75964J84736j75060j75306
3446g30557N2708q1510J32759k17551M17310j35279J69017j43830k4914P2635
$$ plain form
3520 -711020 -693664 -796139 -757970 -719966 -801356 -707886 -732193 -484421 -736530 -739158 -668874
3509 -668874 -690074 -793590 -866710 -660731 -687520 -500964 -658296 -470185 -815978 -566284
3499 -566284 -799429 -614014 -743628 -810845 -870129 -741150 -829589 -675576 -782960 -722087
3489 -722087 -764999 -566084 -637880 -568893 -815673 -630492 -665935 -691832 -764619 -885078 -653259
3478 -653259 -738398 -696535 -610435 -793697 -651302 -626958 -510385 -527964 -793344 -787954 -572558
3467 -572558 -470380 -677242 -700816 -636333 -665359 -585987 -529478 -500052 -728645 -716271 -784941
3456 -784941 -749113 -658581 -888849 -808122 -540428 -740891 -564927 -380191 -555251 -730557
3446 -730557 -677849 -759359 -626600 -844151 -426841 -562120 -393103 -536933 -561847 -489212
3436d89212j15706L4777J16431l7469r917M745q7743n5962O9218j84271L41399
3425d13710k31817K13086k12345J98525j76857J55912j35182q3719j0598K3610
3415f73095N0720J45242l40835R9365p6769J92598r7483J34327j78207R2783r4064
3404g45418Q2278J37908J71075m64881K82662j77299Q3830p1657J08409j52445
3394g45538K0117R9586r5219o1237p0827L6846J71555O5533N9092j17113P0106
3383e67099j31214L02886j82879P4703p4449n401Q6420j89627J29576j24932j50480
3372h32496K24417j18671J23J66743o5152q9119Q2152N9324j21833P4883q0568
3361g00197K22013k2213k0879j75370J12128l9471J97771k95726L40691k35813
$$ plain form
3436 -489212 -604918 -570141 -453710 -491179 -501096 -496351 -584094 -640056 -570838 -755109 -413710
3425 -413710 -645527 -432441 -644786 -446261 -623118 -467206 -602388 -686107 -696705 -673095
3415 -673095 -622375 -477133 -817968 -718603 -795372 -602774 -700257 -565930 -744137 -651354 -745418
3404 -745418 -663140 -525232 -354157 -819038 -536376 -713675 -629845 -701502 -593093 -745538
3394 -745538 -725421 -625835 -721054 -782291 -853118 -816272 -644717 -579184 -520092 -637205 -567099
3383 -567099 -698313 -395427 -578306 -503603 -578052 -583453 -497033 -686660 -557084 -682016 -832496
3372 -832496 -608079 -726750 -726627 -559884 -625036 -714155 -632003 -572679 -694512 -619629 -700197
3361 -700197 -478184 -500397 -521276 -696646 -584518 -623989 -426218 -721944 -381253 -617066
3351f17066Q7101m3353j21238j3244J90910R1288k97428K20082k60110K42408
3341e20650K1320j13079P0874L3884j22761R2761l2622o1293J99044k51286J56332
3330e27476J4778m8256m6489J14851k4647R6876j24918j40954J95351p6728O4879
3319e02733M6447p1846j24044J31370j7869j20304K60723m3840J50194k79878
3309e71780M08981m83115J56460J13818r4791Q3891J35695k41161L31254j93110
3299c53858J54845l30334L90820j78600J31535J47023l06251L17449j88698K16814
3289G45k65779K39511j38702J57296j66196L05438k0917p7462K00322J52119o5219
3278C21156J41230J96641L24686L03466L28135M77173L85379J67755q6737q93749
$$ plain form
3351 -617066 -529965 -573318 -694556 -707800 -516890 -425602 -723030 -502948 -763058 -520650
3341 -520650 -499330 -612409 -541535 -507651 -630412 -537651 -570273 -631566 -432522 -683808 -527476
3330 -527476 -512698 -560954 -607443 -492592 -517239 -420363 -545281 -686235 -490884 -567612 -502733
3319 -502733 -456286 -528132 -652176 -520806 -538675 -658979 -398256 -442096 -291902 -571780
3309 -571780 -162799 -645914 -489454 -375636 -470427 -386536 -250841 -492002 -160748 -353858
3299 -353858 -199013 -529347 -138527 -317127 -185592 -38569 -344820 -27371 -216069 745
3289 745 -265034 -25523 -164225 -6929 -173125 132313 111396 33934 234256 386375 321156
3278 321156 462386 659027 983713 1287179 1615314 2092487 2477866 2645621 2558884 1665135
3268A665135l54669n13701k61240j28768k07221o1347k8944n9935Q8668M3153
3258A81131q1150k1700P018L6408M3589j0693j23662J06354j22571l7202M4654
3247B2176J86143l46661M01177j97724J20226R2452j0283n8121L79720j36887
3237D52218J07193r2104J6610M9235P7847l6580K19037K7696K36319O9149J42418
3226A269038Q6734j09978L23632Q5171L10790J29378L08864L79417L40739L22372
3216C446157J91426L18183M53908M37841O83932R72460J602427K111134L514753
3207A3732221N386815P632722Q940085J852724j137559q764143q090357n998255
3199A3554253m430559k631425j543451r22421o75303l57767l41701J41342l57553
$$ plain form
3268 1665135 1310466 796765 535525 406757 199536 138189 109245 49310 137978 181131
3258 181131 99981 78281 85299 121707 165296 154603 30941 137295 14724 -22478 22176
3247 22176 208319 -138342 262835 65111 185337 277789 267506 209385 589105 452218
3237 452218 559411 467307 483917 533152 610999 574419 793456 821152 1057471 1126620 1269038
3226 1269038 1355772 1245794 1569426 1654597 1965387 2094765 2403629 2783046 3123785 3446157
3216 3446157 3637583 3955766 4409674 4847515 5531447 6503907 8106334 10217468 13732221
3207 13732221 19119036 26751758 35691843 37544567 36407008 27642865 19552508 13554253
3199 13554253 9123694 6492269 4948818 4026397 3351094 2993327 2651626 2792968 2435415
3190B435415P5857n46104l39749k63433j02508k66789j05066J2799l74031J20498
3180F46889l50760L45654m48361M18905l30450J57540j13076k5468J17486j20586
3170B97773l594j02204l1187q3263R992L4624k69578P6480J17307k14434O0161
3159a07923j37110O9854m3732j58123J59948k81441M60987k79709K34143m00361
3149d83467K06280j13201R5516k19977j69311K86510J72969l3600j08555l550
3139c70386j81892L28044j54618p1050j87349K52400k69294L15482j86704J00972
3129d24395k16467L66725l03375J75560j36379L3135J55967l57420J92594n936
3119e19991R5334o8602Q0684J34746m00486J95504k17980J94803J13994o8829
$$ plain form
3190 2435415 2511272 1965168 1625419 1361986 1259478 992689 887623 900422 526391 646889
3180 646889 296129 641783 193422 612327 281877 439417 326341 300873 418359 297773
3170 297773 294179 191975 160788 77525 87517 122141 -147437 -70957 46350 -168084 -107923
3159 -107923 -245033 -175179 -218911 -377034 -217086 -498527 -37540 -317249 -83106 -483467
3149 -483467 -277187 -390388 -294872 -514849 -684160 -397650 -224681 -258281 -366836 -370386
3139 -370386 -552278 -224234 -378852 -449902 -637251 -384851 -654145 -338663 -525367 -424395
3129 -424395 -640862 -274137 -577512 -401952 -538331 -505196 -349229 -706649 -514055 -519991
3119 -519991 -424657 -493259 -412575 -277829 -678315 -482811 -700791 -505988 -391994 -460823
3109d60823l5071l01513J78409Q5791r0140k7999n8954K47147k46475J35337r5646
3098f69937J23723j59501K15007j28809J25373l00276L20068k18143k1186j5631
3088g29312p979Q4849l3677K33670k13326K5231L9502K14928l56833K11683k54966
3077g86230K51219j90877J53953K71372k94517K8659J70957k59170p6154j40397
3067h71185K70435l6452J40914p350j35029l8263k8918n0286K0276Q1757J5917
3056f38184k0071k574K27417k19551J04119j25730O3990j18362k7721J72231o3933
3045f48369k3499M3826j29666O4104j5650O7895R574l0294k02970K53493k65452
3034h77008Q7057J06534P8124k07985J57494R2180K3818k37986R1182k2627J30470
$$ plain form
3109 -460823 -495894 -797407 -618998 -533207 -623347 -651346 -710300 -463153 -709628 -574291 -669937
3098 -669937 -546214 -705715 -490708 -619517 -494144 -794420 -474352 -692495 -713681 -729312
3088 -729312 -737291 -652442 -686119 -452449 -665775 -640544 -601042 -386114 -742947 -531264 -786230
3077 -786230 -535011 -725888 -571935 -300563 -595080 -566421 -395464 -654634 -730788 -871185
3067 -871185 -600750 -637202 -496288 -503638 -638667 -676930 -705848 -756134 -735858 -654101 -638184
3056 -638184 -658255 -660829 -433412 -652963 -548844 -674574 -610584 -728946 -756667 -584436 -648369
3045 -648369 -671868 -628042 -757708 -693604 -709254 -641359 -631785 -662079 -865049 -611556 -877008
3034 -877008 -789951 -683417 -605293 -813278 -655784 -563604 -539786 -777772 -686590 -709217 -578747
3023e78747q8439R4294k86538M13746l19968R0514j07954K63676l26467L15737
3013e30146k95254K70300l4478n6194j0579Q209k05484K35606J8836J429k2363
3002f20118K0213O5808j59938J32951k89084M5140p0480J30668J20132j6942p8240
2991g19890J60957L590j64537J39720j16505J93291o7680j06826j92173R8668
2981g71385R0817J35141j47592L620K3520K54631j73701J4524P6230l03985L40984
2970d57196j06135K30434m13834L14941k96525O6429K8006N1634o939j56939J57887
2959e88237j74394J74988l52636L42574k83303K51717q6671J61109l45301K46880
2949f53274p2243J71472k22555O0080r4105p7244K73576j92494K01943j91944
$$ plain form
3023 -578747 -667186 -572892 -859430 -445684 -765652 -675138 -783092 -519416 -845883 -530146
3013 -530146 -825400 -555100 -589578 -645772 -656351 -648142 -853626 -618020 -599184 -597755 -620118
3002 -620118 -599905 -534097 -694035 -561084 -850168 -805028 -875508 -744840 -624708 -641650 -719890
2991 -719890 -558933 -555343 -719880 -580160 -696665 -503374 -571054 -677880 -870053 -771385
2981 -771385 -680568 -545427 -693019 -689399 -665879 -411248 -584949 -570425 -494195 -798180 -457196
2970 -457196 -563331 -332897 -746731 -431790 -728315 -661886 -633880 -582246 -589185 -746124 -588237
2959 -588237 -762631 -587643 -940279 -597705 -881008 -629291 -715962 -554853 -900154 -653274
2949 -653274 -725517 -554045 -776600 -716520 -810625 -887869 -614293 -806787 -604844 -796788
2939g96788J92142k24760K5758o0094K33878J67509k87459m803n6185J54543j14281
2928g70540k4999j05296J46112N3453l2797k11717J16376Q7873J48559k21569
2918h14545P8578l4582M0685J04632j48394K24130j70472k0718r831q6836K19261
2907f18092j06436J12133o3899L8030m6327p1958m4041J03158q839j68682L72943
2896e02010k33539J8263M0300M7063J4831k33302R9421o738M4792j0241N4836
2885f66324r4352m7723J50585m2364o0105l1793M1111J02732l2285j16949K73994
2874e23473l49924K57886k25667K57252k69468L59826k8624j24080j9001j09001
2864g74274J46155n8748J41782k49173L33059k58428j0707N1305o7960m1617P8844
$$ plain form
2939 -796788 -604646 -829406 -803648 -863742 -629864 -462355 -749814 -754617 -810802 -656259 -770540
2928 -770540 -795539 -900835 -754723 -701270 -734067 -945784 -829408 -741535 -592976 -814545
2918 -814545 -735967 -770549 -729864 -625232 -773626 -549496 -719968 -740686 -750517 -837353 -618092
2907 -618092 -724528 -612395 -676294 -638264 -684591 -756549 -800590 -697432 -706271 -874953 -502010
2896 -502010 -735549 -717286 -676986 -629923 -615092 -848394 -748973 -755711 -710919 -721160 -666324
2885 -666324 -760676 -808399 -657814 -700178 -760283 -792076 -750965 -648233 -680518 -797467 -523473
2874 -523473 -873397 -615511 -841178 -583926 -853394 -493568 -522192 -646272 -665273 -774274
2864 -774274 -628119 -686867 -545085 -794258 -461199 -719627 -730334 -679029 -746989 -788606 -709762
2853g09762j32544O9050R7326J03451l07300K99473k07213L5325J73334l03866
2843h82726K08560l28311L81356j11598J72770j62943j03005J89425q9425N163
2833g20734j16462M9105l3292J60042j7411N4828j85349q0445N4800K88318k62375
2822h08975K31899j40563j885k1961r4032J70208j10338j28911K04512J30274
2812e69772j95609J77454j14859R8691j35472J25065r4351j76086J36627o7902
2802h16214N5163M7752j12759R0980k985j37216J24305O8507R3939k29384J91106
2791f26806l1587J21384k09638k439J08536j50419m864P6958J0642J2403n9458
2780g55288J53221o3595r6602K0390j0590q4853R1602k3647M2136Q9884l0737
$$ plain form
2853 -709762 -842306 -773256 -675930 -572479 -879779 -580306 -787519 -752194 -578860 -882726
2843 -882726 -674166 -1002477 -621121 -732719 -559949 -722892 -825897 -636472 -725897 -720734
2833 -720734 -837196 -788091 -821383 -661341 -678752 -623924 -809273 -889718 -834918 -546600 -808975
2822 -808975 -577076 -717639 -719524 -741485 -835517 -665309 -775647 -904558 -700046 -569772
2812 -569772 -765381 -587927 -702786 -604095 -739567 -614502 -708853 -884939 -748312 -816214
2802 -816214 -761051 -713299 -826058 -735078 -738063 -875279 -750974 -682467 -588528 -817912 -626806
2791 -626806 -658393 -537009 -746647 -749086 -640550 -790969 -795833 -718875 -708233 -695830 -755288
2780 -755288 -602067 -665662 -762264 -741874 -752464 -837317 -745715 -769362 -727226 -637342 -668079
2769f68079J52199M659j94818j8398m5264N2458l2247M5566j65179J63239O1074
2758f44790j47325K19068m00616J61459j2131J74408J04852l80793K24619r0949
2748g92198M9804j46401N7128J99261P4611m9941j1616j15546O8566j93845N2606
2737h07571m3163J59374j2693p431o6438N5147P9490o0586j39572K04670r8623
2726g37396K14672k12503j33439J42977j4850L2682l6409J0913J51302j25508
2716g07559J40398j95083L5181O9046K1873n1578Q9923J35767k44184J65669l68030
2705i08577K13721q656J01562L508k25754K05173r6563K95483l06382J46778j86224
2694g65931K8653q6770J79783K5486j52561J40426o3246J96914l69601J93437
$$ plain form
2769 -668079 -515880 -511221 -706039 -724437 -769701 -717243 -749490 -703924 -869103 -705864 -644790
2758 -644790 -792115 -573047 -973663 -812204 -824335 -649927 -545075 -925868 -701249 -792198
2748 -792198 -742394 -888795 -831667 -632406 -557795 -607736 -619352 -734898 -666332 -860177 -807571
2737 -807571 -850734 -691360 -704053 -711484 -777922 -722775 -643285 -703871 -843443 -638773 -737396
2726 -737396 -522724 -735227 -868666 -725689 -740539 -707857 -744266 -733353 -582051 -707559
2716 -707559 -567161 -762244 -727063 -658017 -636144 -687722 -597799 -462032 -706216 -540547 -908577
2705 -908577 -694856 -703512 -601950 -598442 -824196 -619023 -715586 -420103 -726485 -579707 -765931
2694 -765931 -737278 -824048 -644265 -618779 -771340 -630914 -694160 -497246 -866847 -673410
2684f73410j24481L15933j64081K4180k32578K87322j57403J94715j50635O432
2674f74006k4564K6149q2625J12789j4480N3454o5022K8833j05844K08375o9888
2663f06829k00793J8250j3528n6168J42720M8093J12615j84230o0368K8439J70872
2652f00927k01295J66371k66404K35301m8084K6147j42008Q0600q8755K32198
2642f06856P7768j41936k02924J61278Q9573r8975j15699J3578O0523J2137J62303
2631e89230l21481K65634k25006J25913J04852j14400K49392l53873J44274j19036
2621h32961K99314j62176K00952j74205l0777J1971J18526r1551P0601l01184
2611h91490M00647k64958K16776l3859j83439K7965n5890K42565p4825j42710
$$ plain form
2684 -673410 -797891 -481958 -646039 -621859 -854437 -567115 -724518 -529803 -680438 -674006
2674 -674006 -698570 -672421 -755046 -642257 -656737 -603283 -668305 -639472 -745316 -536941 -606829
2663 -606829 -807622 -789372 -802900 -859068 -716348 -668255 -555640 -739870 -800238 -771799 -600927
2652 -600927 -802222 -635851 -902255 -666954 -715038 -688891 -830899 -750299 -839054 -606856
2642 -606856 -529088 -671024 -873948 -712670 -623097 -722072 -837771 -824193 -763670 -751533 -589230
2631 -589230 -910711 -645077 -870083 -744170 -639318 -753718 -504326 -858199 -713925 -832961
2621 -832961 -533647 -695823 -494871 -669076 -699853 -687882 -569356 -660907 -590306 -891490
2611 -891490 -490843 -755801 -539025 -572884 -756323 -728358 -784248 -541683 -616508 -759218
2601g59218l681N8210O2878m2658L40699m19950J75409k38574J53495r7249n5602
2590h26241J13095k1271k5595j06607J10643p4912l8224n1890L87503j36882n5017
2579g25398k9497n4755K14044j20407L0814j59640K42892j47578N6614k07804
2569i00715L6688j02783J51640m2277K14199q1296J27288J0224k93505J51179
2559g29358j01679J70245o04r0304K0540K81353j61291j02547J10524j57781K6556
2548g34346K0106m0498r6715K02243k12858J22706j38946J94595r1862J2547m4010
2537h07038R1811o8682Q9315L0079P4090j12512N4J3832n99j52773K07482n4777
2525f89718R8695k2239l8848j11785J04805K777o3604J06232n4067K810O364K7172
$$ plain form
2601 -759218 -762899 -704689 -641811 -684469 -343770 -763720 -588311 -826885 -673390 -770639 -826241
2590 -826241 -713146 -734417 -760012 -866619 -755976 -830888 -869112 -921002 -533499 -670381 -725398
2579 -725398 -754895 -809650 -595606 -716013 -685199 -844839 -601947 -749525 -692911 -900715
2569 -900715 -864027 -966810 -815170 -857447 -643248 -724544 -597256 -587032 -880537 -729358
2559 -729358 -831037 -660792 -661396 -751700 -731160 -449807 -611098 -713645 -603121 -760902 -734346
2548 -734346 -714240 -754738 -851453 -649210 -862068 -739362 -878308 -683713 -775575 -763028 -807038
2537 -807038 -715227 -783909 -694594 -664515 -590425 -702937 -702883 -689051 -689650 -842423 -634941 -689718
2525 -689718 -591023 -613262 -652110 -763895 -659090 -656313 -719917 -613685 -667752 -664942 -658578 -631406
2513f31406M6612o6817j8076N2105j27288N6300n6575R3608j48486j3794q831
2502h22648j9915L55915l47784J98968j61599K24673j47873Q585j9256J90612
2492e40322j46383n9786M0502n3099O6121j49941K4759n4888K06159j09919J64953
2481f11844j35442J63282j40524j93136J68613j93386L65193j34331L5885o4608
2471g40298l6993j60654J68225J93259j03879J53241j01168j22540J76383k95219
2461h69643Q0018j89968J59918J34255o101R2654j61458k9866J49005j19195m6779
2450h07160J41166l1838J9115K5812k61506J24463o3215K1275j31998K31472l8264
2439g70678J32976O8419r5378l6775j62268n3623K52866j0205j5799k51271K66577
$$ plain form
2513 -631406 -584794 -651611 -669687 -617582 -744870 -688570 -745145 -651537 -800023 -813817 -822648
2502 -822648 -842563 -486648 -834432 -635464 -797063 -572390 -720263 -711678 -730934 -540322
2492 -540322 -686705 -746491 -705989 -759088 -692967 -842908 -818149 -873037 -666878 -776797 -611844
2481 -611844 -747286 -584004 -724528 -917664 -749051 -942437 -577244 -711575 -675690 -740298
2471 -740298 -777291 -937945 -769720 -576461 -680340 -527099 -628267 -750807 -574424 -869643
2461 -869643 -789625 -979593 -819675 -685420 -691521 -598867 -760325 -790191 -641186 -760381 -807160
2450 -807160 -665994 -697832 -678717 -652905 -914411 -789948 -853163 -831888 -963886 -732414 -770678
2439 -770678 -637702 -569283 -664661 -701436 -863704 -917327 -664461 -674666 -690465 -941736 -675159
2428f75159j02782P3183K9956o8597j8791J59308k55319J88767k80267J96137
2418g53564p3716J31350J2278n1418L04046l73534K92920k53852J88106l16905
2408h94289J69970o2803J72293j47536P6972K7766j91090P744J58689j72885J36138
2397g19031j44540L35913k52336J17268j14356J67453j32305k14182K99504p2268
2387g28880J24396o5387j10879k44050M55770j08426j04582K34428k64843K27435
2377e85018k95r1740j86514J03288K6186R2860o4519J00922j57920Q0954M5165
2366f36631o8321J59597k31940n3236m4891M0335J64176L6648n1077m2505K19519
2355e08326k04799J9130O08k8254k079R5781n5627J7738K32822k21696P9921k47762
$$ plain form
2428 -675159 -777941 -704758 -674802 -743399 -762190 -602882 -858201 -669434 -949701 -753564
2418 -753564 -827280 -695930 -683652 -735070 -431024 -804558 -511638 -765490 -577384 -894289
2408 -894289 -724319 -787122 -614829 -762365 -685393 -657627 -848717 -840973 -682284 -855169 -719031
2397 -719031 -863571 -527658 -779994 -662726 -777082 -609629 -741934 -956116 -656612 -728880
2387 -728880 -604484 -669871 -780750 -1024800 -569030 -677456 -782038 -547610 -812453 -585018
2377 -585018 -585313 -677053 -863567 -760279 -734093 -641233 -705752 -604830 -762750 -681796 -636631
2366 -636631 -704952 -545355 -777295 -830531 -875422 -835087 -670911 -634263 -685340 -727845 -508326
2355 -508326 -713125 -693995 -693387 -721641 -723720 -627939 -683566 -665828 -433006 -654702 -574781 -822543
2343h22543J88808J091R5124j50155Q079L0826n9715O6866K6283o1259j71222
2332h47817M8927j2736J29822j91421K92394j64476J64050j24771j43744Q6491
2322g63281k9919J50758j65368J44622r3850l3086j4289P1235N244Q4742j36156
2311g79348O0943p3224J03084O298J23300j33597j21808J98320j44361r2623r8441
2300i51457K18049R1998j08780K01309j96605R0759m5998P600L891j5141j23717
2289h28092K25021j16337K90574l75242J35301r4189K0927L0366M2688l0243K7754
2278f71472Q3927k45633J47860j93601J31642J37101P9808k2523j27455J00141
2268e80205K284L820j17178P3071m7179K3611O6718j58811J32217j80649J2443
$$ plain form
2343 -822543 -633735 -632644 -537520 -687675 -679596 -648770 -708485 -641619 -615336 -676595 -847817
2332 -847817 -798890 -811626 -681804 -873225 -580831 -745307 -581257 -706028 -849772 -763281
2322 -763281 -793200 -642442 -807810 -663188 -757038 -790124 -804413 -733178 -727934 -643192 -779348
2311 -779348 -718405 -791629 -688545 -682247 -558947 -692544 -814352 -616032 -760393 -853016 -951457
2300 -951457 -733408 -641410 -750190 -548881 -745486 -654727 -700725 -693125 -689234 -704375 -828092
2289 -828092 -603071 -719408 -428834 -804076 -668775 -762964 -742037 -711671 -668983 -699226 -671472
2278 -671472 -587545 -833178 -685318 -878919 -747277 -610176 -530368 -552891 -680346 -580205
2268 -580205 -577921 -574101 -691279 -618208 -665387 -641776 -575058 -733869 -601652 -782301 -769858
2257g69858m1044P717r1898J92765K3234K9262j89464J36241n6043L129J88516
2246e67443j16381L2202j62191K16190j67360J59593j39590L1155j86996K75652
2236f25169k58370L17589p5576N6048j46231J38883j8816k58718L3762m9489K87766
2225e98321j55547j33294R0298K56589k95468K08898j03201R3837r8459N4541
2215f80127l3741P3422L0284J880l7323n1358j20937K02529m6173k124j87684
2204h51352J96506Q772j6667Q7551j91667N627O6812j0498J57442j82363K13757
2193e16080o6497j2211j79948M9993n3627K21652k49388O5506l0312K94082l55912
2182h32742N3790J4428K04827j96976M9800k4172p9814Q668K53113j599p1464
$$ plain form
2257 -769858 -810902 -803185 -895083 -702318 -679084 -649822 -839286 -703045 -759088 -755959 -567443
2246 -567443 -683824 -651622 -813813 -597623 -764983 -605390 -744980 -713825 -900821 -625169
2236 -625169 -883539 -565950 -641526 -585478 -731709 -592826 -611642 -870360 -836598 -886087 -598321
2225 -598321 -753868 -887162 -796864 -540275 -835743 -626845 -730046 -636209 -734668 -680127
2215 -680127 -713868 -640446 -610162 -608282 -645605 -696963 -817900 -615371 -661544 -663668 -851352
2204 -851352 -654846 -646074 -662741 -575190 -766857 -761230 -694418 -704916 -547474 -729837 -516080
2193 -516080 -582577 -594788 -774736 -724743 -778370 -556718 -806106 -740600 -770912 -476830 -832742
2182 -832742 -778952 -764524 -559697 -756673 -706873 -731045 -810859 -802191 -549078 -550677 -622141
2171f22141k16298K78078o9192O570j24631K8392L5707j78121k2371J69915l8865
2160g52957L962J64018j37152p373m9153P6177j46298J05521M9734O142R4261
2149e93118j45260K5984K38484k72979O2223j19375Q5988j11992K39372j38733
2139g29406j71824L5085N3368Q2867N3693N3109j88371J80580j82576l0557O6758
2128g77274R2575K2959k8999O9751J74195m4541p4055j37759O440J06259l8806
2117f29255K59300l77517J36946q3771J71119k31044K4612O5184k7765J974q0809
2106g71026K05535r8792K5244k43680M09926k29066m1189m2632R8953m817J5356
2095f76188j33248K31477q018o0554j76749J13849n9773J10807k6111J4099j05475
$$ plain form
2171 -622141 -838439 -560361 -629553 -622983 -747614 -719222 -683515 -861636 -884007 -714092 -752957
2160 -752957 -748995 -584977 -722129 -729502 -778655 -702478 -848776 -743255 -693521 -687379 -593118
2149 -593118 -738378 -712394 -473910 -746889 -684666 -804041 -718053 -830045 -590673 -729406
2139 -729406 -901230 -866145 -812777 -729910 -676217 -623108 -811479 -630899 -813475 -844032 -777274
2128 -777274 -684699 -661740 -690739 -620988 -446793 -491334 -565389 -703148 -696708 -590449 -629255
2117 -629255 -369955 -747472 -610526 -694297 -523178 -754222 -729610 -664426 -692191 -690217 -771026
2106 -771026 -565491 -664283 -639039 -882719 -472793 -701859 -743048 -785680 -686727 -691544 -676188
2095 -676188 -809436 -577959 -585977 -646531 -823280 -709431 -769204 -658397 -684508 -670409 -775884
2084g75884K13916k26001J06361J4844k4776J12463j7883J08095j29453N0257
2074e68061k39449j15042K20648n7280j2998K09702j00903J1431l632o2873j62767
2063h81224J74688J01041j20174J08219j74196Q8195R3342j04556J12565p7620
2053f79720q8096J35993j7432L6101J33064j02771N7551j06448j90273K81824
2043e40207k16105R0631j56881J83855j18861M7913L9672Q2478j44401J52886
2033e79020k3114j33691J58334k14981k846P7966j9991j90906L72218j82482O8027
2022f70486q2571N7210J18687L3660l47054L01369M1461k0861j73872R8088k76161
2011i20530M00661k8546L8220n9757J2540r2560P2362m8510n1086o1915q3953
$$ plain form
2084 -775884 -561968 -787969 -681608 -666764 -691540 -579077 -596960 -488865 -618318 -568061
2074 -568061 -807510 -922552 -701904 -759184 -772182 -562480 -663383 -651952 -655584 -718457 -881224
2063 -881224 -706536 -605495 -725669 -617450 -791646 -703451 -610109 -714665 -602100 -679720
2053 -679720 -767816 -631823 -649255 -613154 -480090 -582861 -525310 -631758 -822031 -540207
2043 -540207 -756312 -665681 -822562 -638707 -757568 -709655 -669983 -587505 -731906 -579020
2033 -579020 -602134 -735825 -577491 -792472 -795318 -717352 -737343 -928249 -556031 -738513 -670486
2022 -670486 -753057 -695847 -577160 -543500 -890554 -589185 -547724 -568585 -742457 -644369 -920530
2011 -920530 -519869 -548415 -510195 -569952 -557412 -649972 -577610 -626120 -677206 -739121 -823074
2000h23074r4465J07629J55587j36321J08158m2819Q1910o4119o810o2364n91
1989g77279R5520P7546p323p2622m1831R5661L4777p9467M7933o7201j17475K88974
1977e22787j37165Q0129k54934J58616k51584K0337K79095m5632j06160R2167
1967f87918Q871k97318K71086j626N9850q1260J12491k08291J99893k24564J95844
1956f52942n6411m1532J23108K07587l19582O4442L5808j0912J4386N7019q9506
1945f68535r3446P5920r267R2779p6827j09763J2317L77924l13942L34951k92221
1934f70110R2887m0640j26237J62683j03920P9695j47065J17307o662J30156k18467
1923g30373J0389k4718K2674j05140P1689R4947M4559k50862K69001o1624J16246
$$ plain form
2000 -823074 -917539 -809910 -654323 -790644 -682486 -725305 -643395 -707514 -714324 -776688 -777279
1989 -777279 -681759 -604213 -611536 -684158 -725989 -630328 -595551 -675018 -627085 -694286 -811761 -522787
1977 -522787 -659952 -579823 -834757 -676141 -927725 -907388 -628293 -673925 -780085 -687918
1967 -687918 -679047 -976365 -705279 -706905 -647055 -728315 -615824 -824115 -624222 -848786 -652942
1956 -652942 -709353 -750885 -627777 -420190 -739772 -675330 -639522 -650434 -636048 -579029 -668535
1945 -668535 -761981 -686061 -695328 -602549 -679376 -789139 -776822 -398898 -712840 -377889 -670110
1934 -670110 -577223 -617863 -744100 -581417 -685337 -605642 -752707 -635400 -642062 -511906 -730373
1923 -730373 -719984 -744702 -722028 -827168 -755479 -660532 -615973 -866835 -597834 -659458 -543212
1912e43212l4067l433N7214j02304o045j9733q0384n2114J71514j83814P1894
1901g24484O1232p5533n0892N3381p4791K17866J5991p0462L6239J30248p2695
1890e53900k31727J50098j39624O7389q1727o3573J40878J90072j57032J44114
1880e35032j96709o0755P3227k37228M06262k19454J86413k54437L48694k22443
1870g11462J60707j34321J05142l9162J1800J58778k63778M3835j00318J50762
1860f18017j70410K31049j46489J59414j00251n4688o9640K47536j28879K21036
1850d29339j94365J07618k72219K77368k10184J55492j14085J90056l44307K01748
1840f32217m8294J64073k4734k30162J2870O5743L3312r1023P2220j21115j3511
$$ plain form
1912 -543212 -577279 -580712 -523498 -625802 -631847 -651580 -731964 -784078 -612564 -796378 -724484
1901 -724484 -663252 -738785 -789677 -736296 -811087 -593221 -577230 -647692 -611453 -481205 -553900
1890 -553900 -785627 -635529 -775153 -707764 -789491 -853064 -712186 -522114 -679146 -535032
1880 -535032 -731741 -792496 -719269 -956497 -550235 -769689 -583276 -837713 -489019 -711462
1870 -711462 -550755 -685076 -579934 -619096 -607296 -448518 -712296 -668461 -768779 -618017
1860 -618017 -788427 -557378 -703867 -544453 -644704 -699392 -769032 -521496 -650375 -429339
1850 -429339 -623704 -516086 -788305 -510937 -721121 -565629 -679714 -489658 -833965 -632217
1840 -632217 -680511 -516438 -541172 -771334 -758464 -692721 -659409 -750432 -678212 -799327 -812838
1829h12838q1586J62013j17067L26579l58128J64680j16533R5116j74600J95584
1819g16780P6831r5214O6049Q7218o9169m9120l2348n9457n8735J97800k31990
1808h84915J86524O399o4711J94111j01749q8652M1803K2800p7904K35765k59485
1797g90014J11633N016R3958q3609J29857k31540j04586K18474r2340J23256r7058
1786g16953J70022j77020M8511K6732K1896m3857j50687M3066o7940K82253r6238
1775f60215p5226K0589j34125l2109K03461l0931M0922M0077p7078j04942J01530
1764g08047L932j98475L07104j75724N1543l0768N298j4374L9145L07078k79768
1753f93056J51820j91146J48883K9851k71353J47049p7938P921l7360K82127r340
$$ plain form
1829 -812838 -894424 -732411 -849478 -522899 -881027 -716347 -832880 -737764 -912364 -716780
1819 -716780 -639949 -735163 -669114 -581896 -651065 -700185 -732533 -791990 -850725 -652925 -884915
1808 -884915 -698391 -691992 -756703 -562592 -664341 -752993 -711190 -688390 -766294 -530529 -790014
1797 -790014 -678381 -673365 -579407 -663016 -533159 -764699 -869285 -650811 -743151 -619895 -716953
1786 -716953 -546931 -723951 -675440 -648708 -626812 -670669 -821356 -778290 -846230 -563977 -660215
1775 -660215 -735441 -714852 -848977 -881086 -677625 -708556 -667634 -627557 -704635 -809577 -708047
1764 -708047 -704115 -902590 -595486 -771210 -719667 -750435 -745137 -759511 -720366 -413288 -693056
1753 -693056 -541236 -732382 -583499 -553648 -825001 -677952 -755890 -747969 -785329 -503202 -512542
1742e12542k33106K30321k45150J75317o910j21963J03330l3266J19205j64845
1732f89609p920j53249K54709j33348K2378m4116J08975o9694J41427j91999O2605
1721f99841o6820O233K07513k10057J32778k08855J24383J50518l59450K55947
1711f67651j54640K26650j54536K89231k29813J05883r4525j17582O0466L3933
1701g02584n7772R2889l7372J92589k48152M13635j70245j6881j90005J40144
1691e83754j0227N7516k75187K40717j85208K08331j13821K0028J04456n7618
1681e94767j14148n5697J15316O3889N1656j08687j98181K21157j58208j00355
1671h78025L95506l41151L06656l54894K65129l20592L19819j42615J1556P2691
$$ plain form
1742 -512542 -745648 -515327 -760477 -585160 -592070 -714033 -610703 -643969 -524764 -689609
1732 -689609 -697529 -850778 -596069 -729417 -707039 -751155 -642180 -711874 -570447 -762446 -699841
1721 -699841 -766661 -760428 -552915 -762972 -630194 -839049 -714666 -564148 -923598 -667651
1711 -667651 -822291 -595641 -750177 -460946 -690759 -584876 -679401 -796983 -736517 -702584
1701 -702584 -760356 -667467 -704839 -512250 -760402 -346767 -517012 -533893 -723898 -583754
1691 -583754 -593981 -536465 -811652 -570935 -756143 -547812 -661633 -641605 -537149 -594767
1681 -594767 -708915 -764612 -649296 -585407 -533751 -642438 -840619 -619462 -777670 -878025
1671 -878025 -482519 -823670 -517014 -871908 -606779 -927371 -607552 -750167 -738611 -665920
$$ [...]
##END NTUPLES=NMR SPECTRUM
##END=
