##TITLE=abcd
##JCAMPDX= 6.0         $$ Bruker NMR JCAMP-DX V2.0
##DATA TYPE= NMR SPECTRUM
##DATA CLASS= NTUPLES
##ORIGIN= UXNMR, Bruker Analytische Messtechnik GmbH
##OWNER= root
$$ XWIN-NMR		Version 3.5
$$ Thu Nov 20 18:24:54 2025 Russian Standard Time (UT+4h)  servis@DPX200
##.OBSERVE FREQUENCY= 200.131235884673
##.OBSERVE NUCLEUS= ^1H
##.ACQUISITION MODE= SIMULTANEOUS
##.ACQUISITION SCHEME= undefined
##.AVERAGES= 32
##.DIGITISER RES= 18
##SPECTROMETER/DATA SYSTEM= spect
##.PULSE SEQUENCE= zg
##.SOLVENT NAME= CDCl3
##.SHIFT REFERENCE= (INTERNAL, CDCl3, 0, 16.4885)
##AUDIT TRAIL= $$ (NUMBER, WHEN, WHO, WHERE, WHAT)
$$ ##TITLE= Audit trail, XWIN-NMR		Version 3.5
$$ ##JCAMPDX= 5.01
$$ ##ORIGIN= Bruker BioSpin GmbH
$$ ##OWNER= servis
$$ F:\spectra/data/av/nmr/H1/1/pdata/1/auditp.txt
$$ ##AUDIT TRAIL=  $$ (NUMBER, WHEN, WHO, WHERE, WHAT)
(   1,<2025-11-20 18:23:12.28 +0400>,<servis>,<DPX200>,
      <created by zg, POWCHK disabled, PULCHK disabled
       configuration hash MD5:
       00 E9 B6 7A A2 85 ED C7 34 08 36 98 17 FE 4E 26
       data hash MD5: 32K
       D0 41 2B 02 8E 6B E7 3B 9A E5 85 85 30 46 1D 04>)
(   2,<2025-11-20 18:24:08.70 +0400>,<servis>,<DPX200>,
      <Start of raw data processing
       efp BC_mod = 2 LB = 0.05 FT_mod = 6 PKNL = 1 PHC0 = -258.8425 PHC1 = 6.301564 SI = 16K 
       data hash MD5: 16K
       43 04 B8 35 E1 84 B1 4F 15 4F DF 20 A3 C3 36 4B>)
(   3,<2025-11-20 18:24:13.20 +0400>,<servis>,<DPX200>,
      <abs ABSG = 5 
       data hash MD5: 16K
       6A F4 8C EC 22 02 31 DA 7F C5 89 F6 60 E0 75 A4>)
(   4,<2025-11-20 18:24:27.37 +0400>,<servis>,<DPX200>,
      <pk PHC0 = -2.8 PHC1 = 0 
       data hash MD5: 16K
       37 C0 A0 F3 32 E3 5C F8 FC C6 BD 6E A6 4A 36 FB>)
$$ ##END=
$$ 
$$ hash MD5
$$ 7F AF EF CB 52 80 9C 3B 92 04 8E 8A 55 F8 3A 78
##$RELAX= 
##$RELAX= 
##$RELAX= 
##$RELAX= 
##$RELAX= 
##$RELAX= 
##$RELAX= 
##$RELAX= 
$$ Bruker specific parameters
$$ --------------------------
##$DU= <F:\spectra>
##$EXPNO= 1
##$NAME= <H1>
##$PROCNO= 1
##$TYPE= <nmr>
##$USER= <av>
##$AMP= (0..31)
100 100 100 100 100 100 100 100 100 100 100 100 100 100 100 100 100 100 
100 100 100 100 100 100 100 100 100 100 100 100 100 100 
##$AQSEQ= 0
##$AQ_mod= 1
##$AUNM= <au_zg>
##$AUTOPOS= <>
##$BF1= 200.13
##$BF2= 200.13
##$BF3= 200.13
##$BF4= 200.13
##$BF5= 500.13
##$BF6= 500.13
##$BF7= 500.13
##$BF8= 500.13
##$BYTORDA= 1
##$CFDGTYP= 0
##$CFRGTYP= 5
##$CHEMSTR= <none>
##$CNST= (0..31)
1 1 145 1 1 1 1 1 1 1 1 1 1 1 1 1 1 1 1 1 1 1 1 1 1 1 1 1 1 1 1 1 
##$CPDPRG= <>
##$CPDPRG1= <>
##$CPDPRG2= <>
##$CPDPRG3= <>
##$CPDPRG4= <mlev>
##$CPDPRG5= <mlev>
##$CPDPRG6= <mlev>
##$CPDPRG7= <mlev>
##$CPDPRG8= <mlev>
##$CPDPRGB= <>
##$CPDPRGT= <>
##$D= (0..31)
0 2 0 0 0 0 0 0 0 0.06 0 0 0 0 0 0 0.0002 0 0 0 0 0 0 0 0 0 0 0 0 0 0 
0 
##$DATE= 1763648591
##$DBL= (0..7)
120 120 120 120 120 120 120 120 
##$DBP= (0..7)
150 150 150 150 150 150 150 150 
##$DBP07= 0
##$DBPNAM0= <>
##$DBPNAM1= <>
##$DBPNAM2= <>
##$DBPNAM3= <>
##$DBPNAM4= <>
##$DBPNAM5= <>
$$ [...]
##$SUBNAM5= <"">
##$SUBNAM6= <"">
##$SUBNAM7= <"">
##$SUBNAM8= <"">
##$SUBNAM9= <"">
##$SW= 20.6817932712277
##$SWIBOX= (0..15)
0 0 3 0 0 0 0 0 0 0 0 0 0 0 0 0 
##$SW_h= 4139.07284768212
##$TD= 32768
##$TD0= 1
##$TE= 0
##$TE2= 300
##$TE3= 300
##$TEG= 300
##$TL= (0..7)
0 120 120 120 120 120 120 120 
##$TP= (0..7)
150 150 150 150 150 150 150 150 
##$TP07= 0
##$TPNAME0= <>
##$TPNAME1= <>
##$TPNAME2= <>
##$TPNAME3= <>
##$TPNAME4= <>
##$TPNAME5= <>
##$TPNAME6= <>
##$TPNAME7= <>
##$TPOAL= (0..7)
0.5 0.5 0.5 0.5 0.5 0.5 0.5 0.5 
##$TPOFFS= (0..7)
0 0 0 0 0 0 0 0 
##$TUNHIN= 0
##$TUNHOUT= 0
##$TUNXOUT= 0
##$USERA1= <user>
##$USERA2= <user>
##$USERA3= <user>
##$USERA4= <user>
##$USERA5= <user>
##$V9= 5
##$VALIST= <valist>
##$VCLIST= <CCCCCCCCCCCCCCC>
##$VD= 0
##$VDLIST= <DDDDDDDDDDDDDDD>
##$VPLIST= <PPPPPPPPPPPPPPP>
##$VTLIST= <TTTTTTTTTTTTTTT>
##$WBST= 1024
##$WBSW= 30
##$XGAIN= (0..3)
0 0 0 0 
##$XL= 0
##$YL= 0
##$YMAX_a= 1627101
##$YMIN_a= -1079387
##$ZGOPTNS= <>
##$ZL1= 120
##$ZL2= 120
##$ZL3= 120
##$ZL4= 120
##$ABSF1= 16.48848
##$ABSF2= -4.193441
##$ABSG= 5
##$ABSL= 3
##$ALPHA= 0
##$AQORDER= 0
##$ASSFAC= 0
##$ASSFACI= 0
##$ASSFACX= 0
##$ASSWID= 0
##$AUNMP= <proc_1d>
##$AZFE= 0.1
##$AZFW= 0.1
##$BCFW= 0
##$BC_mod= 2
##$BYTORDP= 0
##$COROFFS= 0
##$CY= 18.4799938201904
##$DATMOD= 1
##$DC= 0
##$DFILT= <>
##$DTYPP= 0
##$F1P= 9.9274215381318
##$F2P= -0.165520771350173
##$FCOR= 1
##$FTSIZE= 16384
##$FT_mod= 6
##$GAMMA= 0
##$GB= 0
##$INTBC= 1
##$INTSCL= 4.127829e-11
##$ISEN= 128
##$LB= 0.05
##$LEV0= 0
##$LPBIN= 0
##$MAXI= 10000
##$MC2= 0
##$MEAN= 0
##$ME_mod= 0
##$MI= 50
##$NCOEF= 0
##$NC_proc= -3
##$NLEV= 6
##$NOISF1= 3.799351
##$NOISF2= 2.8
##$NSP= 0
##$NTH_PI= 0
##$NZP= 0
##$OFFSET= 16.48848
##$PC= 4
##$PHC0= -261.6425
##$PHC1= 6.301564
##$PH_mod= 1
##$PKNL= yes
##$PPARMOD= 0
##$PSCAL= 4
##$PSIGN= 0
##$REVERSE= no
##$SF= 200.130005582386
##$SI= 16384
##$SIGF1= 3
##$SIGF2= 2
##$SINO= 400
##$SIOLD= 16384
##$SREGLST= <1H.CDCl3>
##$SSB= 0
##$STSI= 16384
##$STSR= 0
##$SW_p= 4139.07284768211
##$SYMM= 0
##$S_DEV= 0
##$TDeff= 32768
##$TDoff= 0
##$TI= <>
##$TILT= no
##$TM1= 0
##$TM2= 0
##$TOPLEV= 0
##$USERP1= <user>
##$USERP2= <user>
##$USERP3= <user>
##$USERP4= <user>
##$USERP5= <user>
##$WDW= 1
##$XDIM= 16384
##$YMAX_p= 277362568
##$YMIN_p= -340223
$$ End of Bruker specific parameters
$$ ---------------------------------
##NTUPLES= NMR SPECTRUM
##VAR_NAME=  FREQUENCY,     SPECTRUM/REAL,   SPECTRUM/IMAG
##SYMBOL=    X,             R,               I
##VAR_TYPE=  INDEPENDENT,   DEPENDENT,       DEPENDENT
##VAR_FORM=  AFFN,          ASDF,            ASDF
##VAR_DIM=   16384,         16384,           16384
##UNITS=     HZ,            ARBITRARY UNITS, ARBITRARY UNITS
##FACTOR=    0.252644378177508, 1,           1
##FIRST=     3299.83951724647, 0,            0
##LAST=      -839.233330435636, 0,           0
##MIN=       -839.233330435636, -340223,     0
##MAX=       3299.83951724647, 277362568,    0
$$ Real data points
##PAGE= N=1
##DATA TABLE= (X++(R..R)), XYDATA
$$ [...]
7152F32586k097M7551L3198N466l7071k065o2834R229l2009m8880l1342l9772
7140D71960l3887O255N698j7703j156K2312j1210k6303o656P059q371O85J8728
7127D27411K1445Q362J8800O3979M337k1102m5390k6814o0054j9272k0407k9413
7115C21882J2171k2560P374P815M1010k9664J1656K2604K0155r912K4309K4069
7103D30909K2667K5796J4720K0950P930J4910m707M5582J2126J9083K7153M3295
7091F80414N0779P4636P3262O7266J26467J24243J44955J87765J83860K78326
7081A991973L92308M99784P20248Q38917P38230K61975l12942o93415p36939o81814
7071C018325n26730l91866l25886k42251k06857j38658j20325n7521o6479m3287
$$ y = [632586, 630489, 678040, 711238, 716704, 679633, 677568, 614734, 623963, 591954, 543074, 511732, 471960, 438073, 444328, 450026, 432323, 431167, 453479, 442269, 415966, 409310, 416369, 407998, 408683, 427411, 448856, 457218, 476018, 539997, 544334, 523232, 477842, 451028, 390974, 371702, 351295, 321882, 334053, 311493, 318867, 326682, 367692, 338028, 349684, 372288, 392443, 382531, 406840, 430909, 453576, 479372, 494092, 515042, 522972, 537882, 533175, 578757, 590883, 609966, 637119, 680414, 731193, 805829, 879091, 946357, 1072824, 1197067, 1342022, 1529787, 1713647, 1991973, 2384281, 2884065, 3604313, 4443230, 5181460, 5443435, 5130493, 4437078, 3700139, 3018325, 2491595, 2099729, 1773843, 1531592, 1324735, 1186077, 1065752, 1008231, 941752, 898465]
7061H98465r168n5642m4636j736o839J5124J9974O9721l4919k9671J6156O716
7049H43545l0442n4196j9380l8570p4257j4137J2700k1678j8594K9169K4656M6880
7037F85696K1316P6738J39073J60008J38455K7501n8199o2706l7560k1181m8835
7026A020306l2959n0011l9389m3669p5090m1151m8212j0077q415K0397M0717L2157
7014G64604P9420J33734J27677J1385j06235q1598k0609j4322L229M430m0947
7003H60768m9523k1229o0178l7215q0876r252R15j5359O14K6683J4074J9394N2026
6990G00842K1141p341k5803j6215j0125J4704J0690r309K1094m604L2653J1013
6978G38740L5517O997K4964J6016K0704j2158J3708j1714L2464J0741K4425j3119
$$ y = [898465, 889297, 833655, 789019, 787283, 780444, 795568, 815542, 885263, 850344, 820673, 836829, 843545, 813103, 758907, 739527, 700957, 626700, 612563, 625263, 603585, 584991, 614160, 638816, 685696, 707012, 783750, 922823, 1082831, 1221286, 1248787, 1190588, 1127882, 1090322, 1069141, 1020306, 987347, 937336, 897947, 854278, 779188, 738037, 689825, 679748, 671333, 691730, 732447, 764604, 844024, 977758, 1105435, 1116820, 1010585, 928987, 908378, 894056, 897285, 901715, 860768, 811245, 790016, 729838, 692623, 611747, 602495, 603410, 588051, 588665, 615348, 629422, 648816, 700842, 721983, 714642, 688839, 672624, 662499, 677203, 687893, 678584, 699678, 695074, 727727, 738740, 774257, 781254, 806218, 822234, 842938, 830780, 844488, 832774, 865238, 875979, 900404, 887285]
6966H87285k4889M1731L2367K8236J645K0887m045L0013N1812L1766Q5387P5635
6954A257830P3983M7169j9216L9110r989N600Q62k905j540k510k4338M7154j1383
6941A399827M3797j3345j724N4668J4768Q9530L8695J24854Q6208R4088N9668
6930A991034j430R017K0671N1340O6585N8171M5080K6683O87J1782M7636N8606
6918B385862L3786P9710J01652J21656J15848J44736J25091J18994P1849Q9699
6908C388883M1857P1122J264K9539J3942M5489M0460P1112N6718Q9856P2087J15038
6896D037367Q2462Q2054J05476J13731P7270P7577M4623J7682k9860q1595j27560
6885D399227q2037j03287j02029o3140q8902m5680j8732j6465J0379p997N3680
$$ y = [887285, 862396, 904127, 936494, 964730, 966375, 987262, 983217, 1013230, 1065042, 1096808, 1182195, 1257830, 1331813, 1378982, 1359766, 1398876, 1388887, 1394487, 1395349, 1392444, 1390904, 1388394, 1364056, 1411210, 1399827, 1443624, 1430279, 1428555, 1483223, 1497991, 1587521, 1626216, 1751070, 1837278, 1931366, 1991034, 1989604, 1998621, 2019292, 2070632, 2137217, 2195388, 2240468, 2267151, 2267838, 2279620, 2327256, 2385862, 2419648, 2499358, 2601010, 2722666, 2838514, 2983250, 3108341, 3227335, 3299184, 3388883, 3430740, 3501862, 3503126, 3532665, 3546607, 3592096, 3632556, 3703668, 3760386, 3850242, 3922329, 4037367, 4119829, 4201883, 4307359, 4421090, 4498360, 4575937, 4620560, 4638242, 4608382, 4526787, 4399227, 4317190, 4213903, 4111874, 4048734, 3959832, 3914152, 3895420, 3878955, 3889334, 3881337, 3935017]
6874C935017N5746K4948N5918L7556Q24q6799r2361j35584j28293j22053j40038
6863C404881r4454j25064j34543j46283j47215j01826q7987j22241o1288q4901
6853B299079l4496j04495m5389o8681k7891l0235n1216n7961k5337n3472m8388
6842A751518p1995l7315o6219p0008q0781o4088o7516n538q3074m4096p953p0903
6830A082032k5357l7822k8130m6642j9733m7254j7320l1251j1796k4804j7613
6819G74310k8339m009O570k3223j8530j9480m0152q060l3836k595M052k4005k8337
6806E54366j1055L521Q103k0520J4377m3220J1425j3655o912m804l3082J8408
6794D76952N136O930r360k7572J5093J1441r8j1037J5425j8747n429K4716n723
$$ y = [3935017, 3990763, 4015711, 4071629, 4109185, 4110009, 4023210, 3930849, 3795265, 3666972, 3544919, 3404881, 3310427, 3185363, 3050820, 2904537, 2757322, 2655496, 2567509, 2445268, 2383980, 2299079, 2264583, 2160088, 2114699, 2046018, 2018127, 1987892, 1936676, 1878715, 1853378, 1799906, 1751518, 1679523, 1642208, 1575989, 1505981, 1425200, 1361112, 1293596, 1288058, 1204984, 1160888, 1152935, 1082032, 1056675, 1018853, 990723, 944081, 924348, 877094, 859774, 828523, 816727, 791923, 774310, 745971, 741962, 748532, 725309, 706779, 687299, 647147, 639087, 605251, 602656, 606708, 582703, 554366, 543311, 546832, 554935, 534415, 548792, 505572, 516997, 503342, 496430, 491626, 458544, 476952, 482088, 489018, 479658, 452086, 467179, 478620, 478522, 467485, 482910, 464163, 458734, 483450, 477727]
6781D77727j2833k6177j5040j9213K5497p437J797N737j5735J1927K6699P269
6769D60218r412K2544l3243j5410n750J7673j8785m163K4241j8222k1577J7854
6757D15968Q081m165K8581l638j8954k4802j8368j9848J3789j0344Q48K8723r340
6744C86531J3837o422Q467k3218J8230J2084k0544N865M4631k5233m846o979J7711
6731D20114l5852R803L5687j2776j7393L531k1074K3921L760K7285J8463O935
6719D62404j0217k0098n660J3864r684L8621K4871J7416M1112L7564K8207K1545
6707F39945O6256r794k6718j0273j3425P461k2804n575J9530l0864K0511M5204
6695F79454N5119K3978l9556l3711k9181j4326M779M2831L7308L4591J03491J09534
$$ y = [477727, 464894, 438717, 423677, 404464, 429961, 422524, 424321, 430058, 414323, 426250, 452949, 460218, 450806, 473350, 440107, 424697, 418947, 436620, 417835, 413672, 437913, 419691, 398114, 415968, 424049, 419884, 448465, 444827, 425873, 401071, 382703, 362855, 376644, 366300, 367148, 395871, 386531, 400368, 393946, 402413, 379195, 397425, 409509, 388965, 394830, 439461, 414228, 409382, 402403, 420114, 384262, 394065, 429752, 416976, 399583, 403114, 382040, 405961, 409721, 437006, 455469, 462404, 452187, 432089, 426429, 440293, 430609, 469230, 494101, 511517, 552629, 590193, 618400, 639945, 706201, 696407, 669689, 659416, 645991, 653452, 630648, 625073, 644603, 613739, 634250, 679454, 734573, 758551, 718995, 685284, 656103, 641777, 646556, 689387, 726695, 761286, 864777, 974311]
6683I74311J09564J15599J03660J01924P2406m9985q6470j10674r0407p6503q4859
6672I78566m3353m3336k7732k8147n467k1617o990o087k7650k1732N095j441Q0614
6659H30723K2338J00228J72585J51905J04533P1672J07526J26158l6870j15186
6649A535612q5665j58992j49608r7127j12470p0613l8503n3038k3294k7979J4721
6638G33044m0625l0364N527k2907L298K7048N141M8450M1820J12011J30017J06438
6626A118898L422J3379M8122m9526n1231p3135l6571q7969o4939R366j2529j5426
6614H01861l5194k7062m6221p074M593q978j530M8386m284K6561K5715L1846O4359
6601H72978N2389O1181J02983Q7003J59866K63844L31482J55955j54846k82486
$$ y = [974311, 1083875, 1199474, 1303134, 1405058, 1477464, 1427479, 1341009, 1230335, 1139928, 1063425, 978566, 935213, 891877, 864145, 835998, 830531, 808914, 801924, 795837, 768187, 746455, 751550, 750109, 830723, 853061, 953289, 1125874, 1277779, 1382312, 1453984, 1561510, 1687668, 1650798, 1535612, 1449947, 1290955, 1141347, 1044220, 931750, 861137, 822634, 769596, 746302, 718323, 733044, 692419, 662055, 667582, 644675, 647973, 675021, 680162, 728612, 770432, 882443, 1012460, 1118898, 1122320, 1135699, 1183821, 1134295, 1083064, 1009929, 973358, 885389, 820450, 829816, 817287, 801861, 766667, 739605, 693384, 686310, 690903, 681925, 680395, 728781, 724497, 751058, 776773, 808619, 872978, 925367, 986548, 1089531, 1176534, 1336400, 1600244, 1931726, 2087681, 1932835, 1650349]
6591A650349k29656q4410o0161J2921O8733P7482o3191r2023r7015l4777k6937
6580A121315R885m058M2751J6292N1985L2554P4032J07476J38478K13173K34044
6569B037927L72006O08669R20030P45929k16808q74719p67345m44780l09180j59135
6559A912594j25405J9647q4189q8951j46764o1621n4411l3644l3855p945O4588
6548A360044R2087O4377N8031O3822N8136Q4444K32774L15157N39952Q98768R00898
6537D668490R5184q54423q90558o30595m15632k67620j37251r0201n2036k6168
6527A399190m2526n9941n9502l5721n1345p5774m5661k3591j7347k973K8441K3565
6515A036815P0927M2509Q3125J40565L03930L14055J20223j91822l10760k09689
$$ y = [1650349, 1420693, 1336283, 1276122, 1289043, 1357776, 1435258, 1372067, 1280044, 1183029, 1148252, 1121315, 1131200, 1127142, 1169893, 1186185, 1238170, 1270724, 1344756, 1452232, 1590710, 1803883, 2037927, 2409933, 3018602, 3938632, 4684561, 4467753, 3593034, 2825689, 2380909, 2071729, 1912594, 1787189, 1806836, 1722647, 1633696, 1486932, 1425311, 1370900, 1337256, 1303401, 1295456, 1360044, 1452131, 1516508, 1574539, 1638361, 1696497, 1780941, 2013715, 2328872, 2868824, 3767592, 4668490, 4763674, 3909251, 3018693, 2388098, 1972466, 1704846, 1567595, 1477394, 1425358, 1399190, 1356664, 1296723, 1237221, 1201500, 1150155, 1074381, 1028720, 1005129, 987782, 984809, 1013250, 1036815, 1107742, 1150251, 1233376, 1373941, 1677871, 1991926, 2112149, 1920327, 1609567, 1399878]
6505A399878j59367p6986q9476n559l4860k3090m5055o108n3528l7676k2454k0872
6493H24847K0067L494o329j4490J7574J9155l988J4315L2884K4642K7804M1185
6481A001160J4561N4849M1044N2036K9788P7265K1766K5214L8805J14379O0142
6470A531009k750n7802k4190j6506J1411l902M5897J7472M1171N2171P8011P5189
6458A747181O5136R3291J16808J36008K12006L26442K95416J87060O6473R2741
6448C338562K51247L15505L29273M05382N17117P08858P80126J094318J092975
6439H833363n9834j092115j133336q21217m72829k38916j78556j68763j41009
6430D526788l3138N1515J70661K75105M57038P32339R32012N97325N570J12285
$$ y = [1399878, 1240511, 1163525, 1074049, 1068490, 1033630, 1010540, 965485, 959377, 905849, 868173, 845719, 824847, 844914, 848408, 842079, 827589, 845163, 864318, 860330, 874645, 907529, 932171, 959975, 1001160, 1015721, 1070570, 1111614, 1163650, 1193438, 1270703, 1292469, 1317683, 1356488, 1470867, 1531009, 1528259, 1470457, 1446267, 1429761, 1441172, 1437270, 1483167, 1500639, 1541810, 1593981, 1671992, 1747181, 1812317, 1905608, 2022416, 2158424, 2370430, 2696872, 2992288, 3179348, 3245821, 3338562, 3589809, 3905314, 4234587, 4639969, 5157086, 5865944, 6646070, 7740388, 8833363, 8773529, 7681414, 6548078, 5726861, 5254032, 5015116, 4836560, 4667797, 4526788, 4493650, 4545165, 4715826, 4990931, 5447969, 6180308, 7112320, 7709645, 7715215, 7827500]
6420G827500N32875R55226R87364Q63682J222218J737441K609686L847698M142979
6411B4726669P30792l416348l711481k700200j507204n88034j01178J66986Q46830
6402A4446832J307709L27788j322079j600522j018533l86061J79157J20350l66009
6393A1688632k04253L50126Q28847J014268Q96784J350774K099503L320292M514084
6384B5859057M298017J149251k937597l348537k611001j347322j24195O76115
6376B1613788J813000L926616N441653K430486l927297n857689m717954l182922
6368A7539681k080701j421647j225718q22061m48356o6945J58649L09063P41110
6359A2683075J356325K161886K291083J170695J3543p39479o38433p32580k01119
$$ y = [7827500, 8360375, 9315601, 10302965, 11166647, 12388865, 14126306, 16735992, 20583690, 24726669, 25457461, 22041113, 18329632, 15629432, 14122228, 13534194, 13433016, 13600002, 14446832, 15754541, 16082329, 14760250, 13159728, 12141195, 11755134, 11934291, 12054641, 11688632, 11484379, 11834505, 12663352, 13677620, 14574404, 15925178, 18024681, 21344973, 25859057, 30157074, 31306325, 28368728, 25020191, 22409190, 21061868, 20937673, 21613788, 23426788, 27353404, 32795057, 35225543, 31298246, 25440557, 20722603, 17539681, 15458980, 14037333, 12811615, 11989554, 11541198, 11474253, 11632902, 11941965, 12683075, 14039400, 16201286, 18492369, 19663064, 19676607, 18937128, 18298695, 17566115, 17364996]
6350A7364996N41474J060693K234520M322208N741500K869881l849320o277085
6342B4008867n085974l612982k485686j758461j329682j012840p58404n05625
6334G459213l01278k02976j8432J81946K55014J87328m3951j1456J41333K13844
6324G860585J29195R4339J97044L27139P15754J458591J809581P30950j251893
6315A2071285j974489j735040j236902q75664o12463m57468l48671l13565k90232
6306D226791j63849j97438r9057m7281p8233l3818o9322j8897m7751l72M4629
6295C515402J10683J14369L3150o6717j12642n5549n5463k7328J3669P2814J46579
6284C688967K30257J60796o2290k27567k00026j78853o4475p2012O0420O3633
$$ y = [17364996, 17906470, 18967163, 21201683, 25523891, 31265391, 34135272, 30285952, 24008867, 18922893, 15309911, 12824225, 11065764, 9736082, 8723242, 7964838, 7459213, 7157935, 6954959, 6936527, 7118473, 7373487, 7560815, 7516864, 7505408, 7646741, 7860585, 7989780, 8084119, 8281163, 8608302, 9324056, 10782647, 12592228, 13323178, 12071285, 10096796, 8361756, 7124854, 6249190, 5636727, 5179259, 4830588, 4517023, 4226791, 4062942, 3865504, 3766447, 3719166, 3640933, 3607115, 3537793, 3518896, 3471145, 3470773, 3515402, 3626085, 3740454, 3773604, 3706887, 3594245, 3538696, 3483233, 3455905, 3469574, 3542388, 3688967, 3919224, 4080020, 4017730, 3790163, 3590137, 3411284, 3346809, 3274797, 3335217, 3398850]
6274C398850J31627P1280Q4064R1402J12332K0788K4624m6400j39058r9112m5962
6263C604435J0525O7064R1407K34532K33001L94850O55838P75474O13646j56251
6253F524521o29760o23806m09605k04734r6906n8561j01345q5133o2003K0621
6243D273289Q1351P8130Q6392J15599J07590J10480J38423K03640K47187L32104
6233E774185M84599O71360Q66994J301994K081740K812316K577943P45873j397246
6224A5919758k100185k034182j679510j158796q15082n59676l46027j73013J7510
6215G070797J26833J84628J12228J93866K81519L36954L38547M20481N69545Q24393
6205A0459791J146712J449961J872476K790022M387933O375920O775221L342610
$$ y = [3398850, 3530477, 3601757, 3685821, 3777223, 3889555, 3910343, 3934967, 3888567, 3749509, 3650397, 3604435, 3614960, 3682024, 3773431, 4007963, 4240964, 4635814, 5291652, 6067126, 6680772, 6524521, 5894761, 5270955, 4861350, 4656616, 4559710, 4501149, 4399804, 4314671, 4252668, 4273289, 4354640, 4432770, 4519162, 4634761, 4742351, 4852831, 4991254, 5194894, 5442081, 5774185, 6258784, 6930144, 7797138, 9099132, 11180872, 13993188, 16571131, 17317004, 15919758, 13819573, 11785391, 10105881, 8947085, 8132003, 7572327, 7226300, 7053287, 7070797, 7197630, 7382258, 7494486, 7688352, 7969871, 8306825, 8645372, 9065853, 9635398, 10459791, 11606503, 13056464, 14928940, 17718962, 22106895, 28482815, 35258036, 38600646]
6197C8600646k663963n327938n425400m286609k842930j660744o60976J97358
6189A5929444Q22933O68245l91056j202185j307185r45832m75989k48042p0459
6180A2779874Q8559M05374Q16691J294321J440446J664961K465290M157677O175274
6171C1288467O665591L249419k749751n219715n120339l775633k179024o69485
6163B1489530R33052K723811L892707L009489j089043m333905m573892l445478
6155A8606271k259024j481601j038927p62061l31347R4686M60171M87735L43228
6146A4119131O24081J317340K070026K109097P84954q84478j403303j132420n31215
6137A7073213m3143O81966J990675L561943M465540L102541j360007m597003m698993
$$ y = [38600646, 35936683, 30608745, 25183345, 20896736, 18053806, 16393062, 15732086, 15929444, 16752377, 17420622, 17029566, 15827381, 14520196, 13574364, 13098375, 12850333, 12779874, 12868433, 13273807, 14090498, 15384819, 16825265, 18490226, 20955516, 25113193, 31288467, 37954058, 41203477, 38453726, 33234011, 28113672, 24338039, 22159015, 21489530, 22422582, 25146393, 29039100, 32048589, 30959546, 26625641, 22051749, 18606271, 16347247, 14865646, 13826719, 13064658, 12733311, 12827997, 13288168, 13775903, 14119131, 14743212, 16060552, 18130578, 20239675, 21024629, 20140151, 18736848, 17604428, 17073213, 17030070, 17712036, 19702711, 23264654, 27730194, 30832735, 29472728, 24875725, 20176732]
6128B0176732l579462k445759j565777j092413q05660n59453k74796j05634j40139
6119I607639k13971j87116j42377j01536j27403j43676m4248J54068L55396L85881
6109I542657K18370L16067P34111J250517J482477Q23418n62069j429640j410446
6100A0965462j191759q34114o71382m88061l61157k82588j81202j37487j36598
6091F681114k8267K8665R0792k806j39902j04901q1175m379N3063Q464r8514r3061
6079F309093o3033m6874K334Q362Q5323J18892L1440j75989k05522j20949q3227
6068E859850n2827l1928j0959k7722K9481J33065K05559K19130L817j36894j29329
6057F061243r2130o0971j01774m1123L7021O4389O5329k0770R793K8980R4851
$$ y = [20176732, 16597270, 14151511, 12585734, 11493321, 10687661, 10128208, 9853412, 9747778, 9607639, 9393668, 9206552, 9064175, 8962639, 8835236, 8691560, 8647312, 8801380, 9156776, 9542657, 9761027, 10077094, 10811205, 12061722, 13544199, 14367617, 13805548, 12375908, 10965462, 9773703, 8939589, 8268207, 7780146, 7418989, 7136401, 6955199, 6817712, 6681114, 6652847, 6681512, 6772304, 6769498, 6629596, 6524695, 6443520, 6439141, 6492204, 6500668, 6402154, 6309093, 6246060, 6199186, 6201520, 6209882, 6295205, 6414097, 6445537, 6269548, 6064026, 5943077, 5859850, 5807023, 5775095, 5764136, 5736414, 5765895, 5898960, 6104519, 6323649, 6327466, 6190572, 6061243, 5969113, 5908142, 5806368, 5765245, 5802266, 5866655, 5931984, 5911214, 5921007, 5949987, 6044838]
6046F044838J55116M5315j29177j38541J4517Q5495J59959J74119R7411N3687
6036F562739M8315L2516J6128K9805j7279j735K2596Q1424P0246M3909j2214n020
6024F871430P6902K7519q1442p0109j6474M7871P2593K4436J9118O2227J2481
6013G046552J87472K11594L06658K24500J65113J70608J68680J59697j4889r6112
6003H529873r4170q5058n449L8577k5225r2479j11286q8966r3729r8968p4875
5992G798245o3397l2923j5761K1094j6435M5128M2093N3446J44001J84821K44174
5981H404486L42148M11064N49490N69234L05300j93663n68902n46935m35286l22226
5971H514710k88143k38675k12261k18962j37401j07685q6313r2197j3141p0145
$$ y = [6044838, 6199954, 6245269, 6116092, 5977551, 5992068, 6077563, 6237522, 6411641, 6509052, 6562739, 6611054, 6643570, 6659698, 6689503, 6672224, 6670489, 6693085, 6774509, 6844755, 6888664, 6876450, 6871430, 6948332, 6975851, 6894409, 6824300, 6807826, 6855697, 6928290, 6952726, 6971844, 7034071, 7046552, 7234024, 7445618, 7752276, 7976776, 8141889, 8312497, 8481177, 8640874, 8625985, 8529873, 8435703, 8350645, 8345196, 8383773, 8358548, 8266069, 8154783, 8065817, 7972088, 7873120, 7798245, 7734848, 7701925, 7686164, 7707258, 7690823, 7735951, 7778044, 7831490, 7975491, 8160312, 8404486, 8746634, 9157698, 9707188, 10276422, 10581722, 10388059, 9819157, 9272222, 8836936, 8514710, 8226567, 7987892, 7775631, 7556669, 7419268, 7311583, 7225270, 7133073, 7119932, 7049787]
5961G049787j2764k2258N499j4255L9428M2924J25610K00401L09731M50067M99639
5950H673809N55260L96077j6409n20323o54930o01249m36779l28929k47140j86261
5940F633126j96141j31475j67805j09044n0199l8189q30K2642O5126P6883N2054
5929F156148M5824J08427J52915K26136L74011M22556M75668K82798m6088k80139
5919G918256m32022m88704l56768l08571k38650k18047j75601j41803j21337n5320
5909E381433p2299N650K3563O9297J28877J22723J60043J82424J14319L8377Q5243
5898F239650J19409K33565L55286L79497K57667l4375k95856m07361l48906k52989
5888F245587j91181j40093j22259n4548m7389k9131L321K3187L9526Q9540J14687
$$ y = [7049787, 7037023, 7014765, 7020264, 7006009, 7045437, 7088361, 7213971, 7414372, 7724103, 8174170, 8673809, 9229069, 9625146, 9608737, 9088414, 8433484, 7832235, 7395456, 7066527, 6819387, 6633126, 6436985, 6305510, 6137705, 6028661, 5978462, 5940273, 5939443, 5962085, 6027211, 6104094, 6156148, 6201972, 6310399, 6463314, 6689450, 7063461, 7486017, 7961685, 8244483, 8198395, 7918256, 7486234, 6997530, 6640762, 6332191, 6093541, 5875494, 5699893, 5558090, 5436753, 5381433, 5309134, 5314784, 5338347, 5407644, 5536521, 5659244, 5819287, 6001711, 6116030, 6154407, 6239650, 6359059, 6592624, 6947910, 7327407, 7585074, 7550699, 7254843, 6847482, 6498576, 6245587, 6054406, 5914313, 5792054, 5737506, 5690117, 5660986, 5664307, 5687494, 5727020, 5816560, 5931247]
5877E931247J13833J28789J74846J52263J10943N8215J9038k0476Q9701J36260
5867F894659J53590J24454P9528k7553q7418q1058p6422J4923n8694M402M3167
5856F983578r437J8050N3299P2151L7735P7636O3385N2233N6019L2590M1445K0308
5844G498992L4583j3232j4638q341j6459K0764J3978k4993m953k3167L1980l4822
5832G459692k3536l4470p318o0505l4756j8999k0910m7693j6370k9220k3088m0755
5820G102072n4405n0539r380j0573n1013l5591n939l2949j1275l9227j1544k9977
5808F759660j663k7315l4175k9293j8534r1988j8251p4104k9720q7952k6498j03724
5796F216443l2478o9567n4108o9728o2163o3694l3416n1676m6924m8370j9681
$$ y = [5931247, 6045080, 6173869, 6348715, 6500978, 6611921, 6670136, 6689174, 6668698, 6758399, 6894659, 7048249, 7172703, 7252231, 7224678, 7137260, 7056202, 6979780, 6994703, 6936009, 6940411, 6983578, 6974141, 6992191, 7045490, 7117641, 7155376, 7233012, 7296397, 7348630, 7404649, 7437239, 7478684, 7498992, 7533575, 7520343, 7505705, 7497364, 7480905, 7501669, 7515647, 7490654, 7485701, 7462534, 7494514, 7459692, 7436156, 7401686, 7394368, 7333863, 7299107, 7280108, 7259198, 7211505, 7195135, 7165915, 7142827, 7102072, 7047667, 6997128, 6987748, 6977175, 6926162, 6890571, 6884632, 6851683, 6840408, 6801181, 6789637, 6759660, 6757997, 6730682, 6696507, 6667214, 6648680, 6556692, 6538441, 6464337, 6434617, 6346665, 6320167, 6216443, 6183965, 6114398, 6060290, 5990562, 5928399, 5864705, 5831289, 5779613, 5732689, 5684319, 5664638]
5785E664638k3750n3134R187o6613m2446k2222l5399k8451n2445p8277l0090p2903
5773E168095n9014o6501r2599m1865q9305r5099m6115r9837k6043r4143r2967
5762D364607n1767n1867p4613n4234j9802r0297n2495L396m891k5279j0289p5280
5750C857189p2107o7894p9988n5402o1303n5206j8673o3770n0074k9158m3494
5739C260120l8928j191q0015l0968m0930k5257l3001k2802j6273m1621q920k137
5727B918077m453J3389J06401P7817R1246j37537j58811q7940r1117p3468o0181
5716B593423l0190j4600m7168j5444j7156j2188k7460m6160m933J0189l586k7056
5704B357671J2604k1111J8034K1252k7238L5590M2976O8717J46415J16391K9348
$$ y = [5664638, 5640888, 5587754, 5596941, 5530328, 5487882, 5465660, 5430261, 5401810, 5349365, 5271088, 5240998, 5168095, 5109081, 5042580, 4949981, 4908116, 4818811, 4723712, 4677597, 4577760, 4551717, 4457574, 4364607, 4312840, 4260973, 4186360, 4132126, 4112324, 4022027, 3969532, 3972928, 3968037, 3942758, 3932469, 3857189, 3785082, 3717188, 3637200, 3581798, 3520495, 3465289, 3446616, 3382846, 3332772, 3303614, 3260120, 3221192, 3220001, 3139986, 3109018, 3068088, 3042831, 3009830, 2987028, 2970755, 2929134, 2920214, 2918077, 2913624, 2927013, 3033414, 3111231, 3202477, 3064940, 2906129, 2818189, 2727072, 2653604, 2593423, 2563233, 2548633, 2501465, 2486021, 2468865, 2456677, 2429217, 2383057, 2378124, 2388313, 2384727, 2357671, 2370275, 2349164, 2367198, 2388450, 2361212, 2396802, 2439778, 2508495, 2654910, 2771301, 2800649]
5693B800649j38122j13075q5416m9776n6191P190j8363J0067J3589k039K2437
5682B390950n494J9281Q957O2760J0765p801j6349J8495l3849K1229o636K2028
5670B484336J2917L5888M0823N4092O3881l2685m3017j1887N111J423m356N0381
5658B656907N2146j4986L4060N610K7930K374L8958K890l064K1775p171n5078
5646B762351j5970n992l0120j144j3939m5187m4724l3674k2283k8291L2535k7929
5634B525633l982m1651j940L4831k321j6151k5260N9j0962K3751m7846L053q518
5621B428696k3661j3711j9889j198m806j2134k2343k3137j0555n0366j189K0540
5609B266247l8257j6898K9570j9582M5465k1613K3113q488J8437j3717M1348J5708
$$ y = [2800649, 2662527, 2549452, 2464036, 2414260, 2358069, 2365259, 2346896, 2356963, 2370552, 2368513, 2390950, 2385456, 2404737, 2413694, 2476454, 2487219, 2479418, 2463069, 2481564, 2447715, 2468944, 2462308, 2484336, 2497253, 2533141, 2573964, 2628056, 2691937, 2659252, 2616235, 2604348, 2609459, 2610882, 2606526, 2656907, 2709053, 2694067, 2728127, 2733737, 2761667, 2764041, 2802999, 2805889, 2802825, 2824600, 2817429, 2762351, 2746381, 2740389, 2710269, 2709125, 2695186, 2649999, 2605275, 2571601, 2549318, 2521027, 2553562, 2525633, 2521651, 2480000, 2478060, 2512891, 2510570, 2494419, 2469159, 2469218, 2458256, 2482007, 2434161, 2437214, 2428696, 2405035, 2391324, 2371435, 2370237, 2365431, 2353297, 2330954, 2307817, 2297262, 2246896, 2245707, 2266247, 2227990, 2211092, 2240662, 2221080, 2266545, 2244932, 2268045, 2259557, 2277994, 2264277, 2305625, 2321333]
5597B321333L6451K1363R834L3375J5660N6615J4125L1559L5337O7256K4877L9195
5585B706980N5534L0879j495O8918J4512O3012N8747L5516K5913P9484K3593O7866
5573C229459L2553K9202N4783K7093J03936n364O9161O8002O3128K2170K6978
5562C721101O7022K6981R5840L0812P6961M889M4055L4935P1430K5199P2590M1856
5550D313671M259K7547P708L280r874L3209M553k909j164J9260O78K4960N253
5537D430431k8584R763R891k151pl1309j9370j2041k7268j561m0274k7556k085
5524D257879j9446k7245n6661n6975l4642j41j5516l5807m3838j3895m3894l8618
5512C871201m0726n4613p262k2175l8593l8684l5427m2484j4531k9662m3051j9801
$$ y = [2321333, 2357784, 2379147, 2388981, 2422356, 2438016, 2494631, 2508756, 2540315, 2575652, 2642908, 2667785, 2706980, 2762514, 2793393, 2791898, 2860816, 2875328, 2938340, 2997087, 3032603, 3058516, 3138000, 3161593, 3229459, 3262012, 3291214, 3345997, 3373090, 3477026, 3471662, 3540823, 3608825, 3671953, 3694123, 3721101, 3788123, 3815104, 3910944, 3941756, 4018717, 4023606, 4067661, 4102596, 4174026, 4199225, 4271815, 4313671, 4317930, 4345477, 4353185, 4356465, 4346591, 4379800, 4384353, 4381444, 4380280, 4399540, 4400218, 4425178, 4430431, 4401847, 4411610, 4421501, 4419350, 4419343, 4388034, 4368664, 4356623, 4329355, 4327794, 4287520, 4259964, 4257879, 4238433, 4211188, 4154527, 4097552, 4062910, 4062769, 4047253, 4011446, 3967608, 3953713, 3909819, 3871201, 3830475, 3775862, 3768600, 3746425, 3707832, 3669148, 3633721, 3591237, 3576706, 3547044, 3503993, 3484192]
5500C484192l3563l8526j8645m8047j1862l9466l5125n858m9592k5455l4297j0665
5488C133091j2569K304k6268p479k6330k4867j4247k5948j3221L490R108l2668
5476B964396j9874m4665j4131m1778j7247k2142m4752l200m9605l8293k3938m2189
5464B602582j7796k1536k5336o1834l0830l8766l4491k8445m3137m059j9645o2653
5452B214054l2788l5620m0490j6336o4674n571j8213k0376j4831p1346k4364k2878
5440A846567k8505k4523k2208l4499k6142o73r915m4350J466o586j3823K3615
5428A660424K5194k6739Q565o928K4824j425L1065q883K4867L1243m592k6862
5416A730753K643l4714M292j0967M941q256Q434j2546J0141K1662L6045O3631
$$ y = [3484192, 3450629, 3412103, 3393458, 3345411, 3333549, 3294083, 3258958, 3253100, 3203508, 3178053, 3143756, 3133091, 3120522, 3122826, 3096558, 3089079, 3062749, 3037882, 3023635, 2997687, 2984466, 2987956, 2997064, 2964396, 2944522, 2899857, 2885726, 2843948, 2826701, 2804559, 2759807, 2756607, 2707002, 2668709, 2644771, 2602582, 2584786, 2563250, 2537914, 2476080, 2445250, 2406484, 2371993, 2343548, 2300411, 2296352, 2276707, 2214054, 2181266, 2145646, 2105156, 2088820, 2024146, 2018575, 2000362, 1979986, 1965155, 1893809, 1869445, 1846567, 1818062, 1793539, 1771331, 1736832, 1710690, 1710017, 1700102, 1655752, 1657218, 1650632, 1636809, 1660424, 1685618, 1658879, 1667444, 1660516, 1685340, 1683915, 1714980, 1706097, 1730964, 1762207, 1757615, 1730753, 1733396, 1698682, 1702974, 1692007, 1696948, 1688692, 1697126, 1684580, 1694721, 1716383, 1752428, 1816059]
5404A816059J34976J71504K74740K21370P4158K8538j02695j20801j69073j73814
5394B154962j35503j32190p4053m1132r409k2144O463j9532M4289J0329L0897
5383A812977J7221r240k1839l3598k6965j7252j0369j4268k3635L5433J7114J2032
5371A737611M1784J3064K5271M8102N9694O2744R2971p963M0973l9982o404j5619
5359B052246n083j28L8116K0996J4751J6894L2227J9635K6716O209M6917j802
5347B267694N2403J4544N6159o567Q4976Q819O3923M1779N4146N3916N4695N4239
5335B800726K2424M6457Q160J0846J6706K7949l5535L8142L3269M7780J165J2718
5323C030807M3761J3007M5704K7215L4162K4275K99K9419K8224L2494J7826L0545
$$ y = [1816059, 1951035, 2122539, 2397279, 2618649, 2692807, 2721345, 2618650, 2497849, 2328776, 2154962, 2019459, 1887269, 1813216, 1772084, 1762675, 1740531, 1746994, 1727462, 1771751, 1782080, 1812977, 1830198, 1820958, 1799119, 1765521, 1738556, 1721304, 1710935, 1696667, 1673032, 1708465, 1725579, 1737611, 1779395, 1792459, 1817730, 1865832, 1925526, 1988270, 2081241, 2073278, 2114251, 2074269, 2067865, 2052246, 2047163, 2047035, 2085151, 2106147, 2120898, 2137792, 2170019, 2189654, 2216370, 2222579, 2269496, 2267694, 2320097, 2334641, 2390800, 2384233, 2469209, 2478028, 2541951, 2583730, 2637876, 2691792, 2746487, 2800726, 2823150, 2869607, 2877767, 2888613, 2905319, 2933268, 2897733, 2935875, 2969144, 3016924, 3018089, 3030807, 3074568, 3087575, 3133279, 3160494, 3194656, 3218931, 3219230, 3248649, 3276873, 3309367, 3327193, 3357738]
5311C357738m420M5081J3211J1512M9544j7477L7886Q615J1734L5544j7658M9088
5299C580398n391O911K3667K6291J6286Q4451Q1910R0435O3698l6056p2215p3740
5287C786645j00976n2938k5868l8587r042k050K9900J3515M3646k8046n7625p9219
5275C479355p6131p9823p8671l7366n7627m8948m5123l6544m7709k8713m0896
5264B901804j8474n9799l4162l2290m2640n1390q814n1738l8571k9875n3248j3668
5252B467135l8376l2418l8450m822n4538l5934q550j7972m9482j7254n6737n5380
5240B057222l652m0938m0708j3170M227l5149j7332j022L941j0289l8250k2344
5228A842536o2805o3661N038k2801j721m9542l5671j448j3664k2700K444K960
$$ y = [3357738, 3353318, 3398399, 3411610, 3423122, 3472666, 3455189, 3493075, 3501690, 3513424, 3548968, 3531310, 3580398, 3575007, 3581918, 3605585, 3631876, 3648162, 3732613, 3814523, 3904958, 3968656, 3932600, 3860385, 3786645, 3685669, 3632731, 3606863, 3568276, 3559234, 3557184, 3587084, 3600599, 3644245, 3616199, 3558574, 3479355, 3403224, 3323401, 3244730, 3207364, 3149737, 3100789, 3055666, 3019122, 2971413, 2942700, 2901804, 2883330, 2823531, 2789369, 2757079, 2714439, 2663049, 2654235, 2602497, 2563926, 2534051, 2480803, 2467135, 2428759, 2396341, 2357891, 2353069, 2298531, 2262597, 2254047, 2236075, 2186593, 2169339, 2112602, 2057222, 2053570, 2012632, 1971924, 1958754, 1962981, 1927832, 1910500, 1909478, 1913419, 1903130, 1864880, 1842536, 1779731, 1716070, 1721108, 1698307, 1696586, 1647044, 1611373, 1609925, 1596261, 1573561, 1576005, 1578965]
5216A578965k7585J2236k7572k3710k1240R439M547J2182j0369N360J4822J7749
5204A544824K2132j966L6618K861K7485M6794J39716K18252K26368l0783j95541
5193B036760j79858j47124m0252p3679m9459k7366j5983j1769M289N180o912K4906
5181A518733n134n056N402J6382M363M4134q583J3714K9925P776P6226M3245N5388
5168A796515L8326l1440P755K9382j1819N1115M5486P5715O6407L1205N2180J0143
5156B160970r654K8571L2114P57L7997M5031N8668N0965L2810L1762L0671L1796
5144B532458M1166L6141L2790N5562L7853L7209P9525P2038M0582L9816N3538
5133C058678O6560R0443M0761Q5835L7711P6487K2144N6424O3384O7243J02156
$$ y = [1578965, 1551380, 1563616, 1536044, 1512334, 1491094, 1500533, 1505080, 1517262, 1506893, 1512253, 1527075, 1544824, 1566956, 1564990, 1601608, 1604469, 1631954, 1678748, 1818464, 2036716, 2263084, 2232301, 2036760, 1856902, 1709778, 1669526, 1595847, 1546388, 1519022, 1503039, 1491270, 1495559, 1500739, 1493827, 1518733, 1513599, 1508543, 1513945, 1530327, 1534690, 1578824, 1570241, 1583955, 1613880, 1621656, 1697882, 1741127, 1796515, 1834841, 1803401, 1811156, 1840538, 1828719, 1879834, 1925320, 2001035, 2067442, 2098647, 2150827, 2160970, 2151316, 2179887, 2212001, 2212758, 2250755, 2295786, 2354454, 2405419, 2438229, 2469991, 2500662, 2532458, 2573624, 2609765, 2642555, 2698117, 2735970, 2773179, 2852704, 2924742, 2965324, 3005140, 3058678, 3125238, 3215681, 3256442, 3342277, 3379988, 3456475, 3478619, 3535043, 3598427, 3665670, 3767826]
5122C767826J8432O9577N1832M4703N6331N8055Q4184O1271O7821N2067Q4288
5111D416387P4957J37455M7846P8084M4031M5453J6264M3448N7993L8631O8250
5100E068799J36583K29143L44144N1060k77724j70851n2393n6842j4416k9645
5090E227858MJ4651r345J895l0852J3263L152L3245k4578m562k2095M1288q209
5077E235715K3375j7523o8J5703j8804j4815l3852p334r033J1502L577J8261L2678
5064E239382l1239n264J6018L1639M5531R2829J49932L01257Q05253J196962N81615
5053H423915m56971n75393m63232m21898m23716l29479j60570m559L13556P64068
5043F665721P48765o13216q73127n73100l61184k18118j27217r8833m4744K9838
$$ y = [3767826, 3786258, 3855835, 3907667, 3952370, 4008701, 4066756, 4150940, 4212211, 4280032, 4332099, 4416387, 4491344, 4628799, 4676645, 4754729, 4798760, 4844213, 4860477, 4903925, 4961918, 5000549, 5068799, 5205382, 5434525, 5778669, 5829729, 5552005, 5381154, 5328761, 5271919, 5257503, 5227858, 5227862, 5242513, 5233168, 5235063, 5204211, 5217474, 5220626, 5253871, 5229293, 5224731, 5202636, 5243924, 5235715, 5259090, 5241567, 5241499, 5257202, 5238398, 5223583, 5189731, 5182397, 5173364, 5184866, 5188443, 5206704, 5239382, 5208143, 5202879, 5218897, 5250536, 5296067, 5388896, 5538828, 5840085, 6645338, 7842300, 8423915, 7966944, 7391551, 6928319, 6506421, 6082705, 5753226, 5592656, 5588097, 5901653, 6665721, 7414486, 6801270, 5928143, 5355043, 4993859, 4775741, 4648524, 4549691, 4504947, 4534785]
5033D534785L4744K726N9824Q5865J35500K74724L46915K88859j0594l29615m51665
5022D972068l64602l23740j57775j78073j30753j34810n0342m9351m2773l4884
5012C504965m9811k3509k7943K5610o6952o4820l1101k2593k0209j1565N514Q152
5000C225738N1846N7308J7407K6262K0611N008J8228K0955R9839J01163O8372
4989C712737P1194J8517P3348J00715J14519J15091J55858K04491K20605M15812
4979E202887O84218J264371J620672Q91229p54754j090091p43494l85405j92054
4970F497579j49187m1611N7731K20914M17330N44124M51363M28185M92763M85746
4960I404937L43583L14512M14667O01306Q99564J138868J186715J111348J183070
$$ y = [4534785, 4569529, 4572255, 4632079, 4717944, 4853444, 5128168, 5475083, 5763942, 5753348, 5423733, 4972068, 4607466, 4283726, 4125951, 3947878, 3817125, 3682315, 3631973, 3582622, 3539849, 3504965, 3455154, 3431645, 3403702, 3429312, 3362360, 3297540, 3266439, 3243846, 3223637, 3212072, 3217586, 3225738, 3277584, 3334892, 3352299, 3378561, 3399172, 3404180, 3422408, 3443363, 3543202, 3644365, 3712737, 3783931, 3802448, 3875796, 3976511, 4091030, 4206121, 4361979, 4566470, 4787075, 5202887, 5887105, 7151476, 8772148, 9663377, 8908623, 7818532, 7075038, 6689633, 6497579, 6348392, 6306781, 6364512, 6585426, 7002756, 7546880, 7998243, 8426428, 8919191, 9404937, 9748520, 10063032, 10477699, 11079005, 11978569, 13117437, 14304152, 15415500, 16598570]
4951A6598570J340082J532357J929621K826365M329359O534991R755469J6693618
4943F1540432L1964020M9279889L6707251k1338130m1807775l1946691k2807964
4936F1591032j5305162j0165380p142857n249174l740556k611498j741741j151739
4928A4482925q31945p82705r43167q14820o40458m46240l73092k67348j62027
4919I221123L8674L22305J120533K874543N043007L717221k481631m941247l399807
4910A1514721k192418j394343r37751o45319m58857l72893k46748k86837k18840
4901D760715j67574j61642j51238j10936j39551j24554q0727r6038j04260m0679
4891C583516k1517k3965n7488l4365n0024m9995q7021m0860j8796l134K6348N3939
$$ y = [16598570, 17938652, 19471009, 21400630, 24226995, 28556354, 35091345, 44846814, 61540432, 93504452, 142784341, 179491592, 158153462, 116345687, 84398996, 61591032, 46285870, 36120490, 28977633, 23728459, 19987903, 17376405, 15634664, 14482925, 13650980, 12868275, 11925108, 11110288, 10469830, 10023590, 9650498, 9383150, 9221123, 9259797, 9582102, 10702635, 13577178, 18620185, 22337406, 19855775, 14914528, 11514721, 9322303, 7927960, 6990209, 6344890, 5886033, 5513140, 5266392, 4979555, 4760715, 4593141, 4431499, 4280261, 4169325, 4029774, 3905220, 3824493, 3728455, 3624195, 3583516, 3561999, 3538034, 3480546, 3446181, 3396157, 3346162, 3259141, 3218281, 3199485, 3196351, 3222699, 3276638]
4879C276638l5012o3945j10418o8212o9549l6732l8014l9895l7622q854j7231
4868B751154K6239j4748O110j0355k0837L1300p70L753l2735P135J2493K462K9197
4855B790398K6831K2284J3952L9111K9409J7960J0939K9436P7013P0331N9729
4844C187393K5064N3109M8825O7989M0909N5127M6062L5326J06044P6941R6932
4833C839721O7931Q2263N6204Q5171P3858J03393O4433J00381P8636Q9142R7174
4822D738307J15406J04726J33355P8530J18821J33207J06518J43179J39839J35697
4812E947585J18627J10469J29410J43002J79514J44584J84542J51270J91047J74621
4802G474671J98493J80476K00956J76763J96985J96573J89211J97631J91497K07393
$$ y = [3276638, 3241626, 3177681, 3067263, 2999051, 2929502, 2892770, 2854756, 2814861, 2777239, 2768385, 2751154, 2777393, 2762645, 2768755, 2758400, 2737563, 2768863, 2768093, 2771846, 2739111, 2746246, 2758739, 2761201, 2790398, 2817229, 2839513, 2853465, 2892576, 2921985, 2939945, 2950884, 2980320, 3057333, 3127664, 3187393, 3212457, 3265566, 3314391, 3382380, 3423289, 3478416, 3524478, 3559804, 3665848, 3742789, 3839721, 3907652, 3989915, 4046119, 4131290, 4205148, 4308541, 4372974, 4473355, 4551991, 4641133, 4738307, 4853713, 4958439, 5091794, 5170324, 5289145, 5422352, 5528870, 5672049, 5811888, 5947585, 6066212, 6176681, 6306091, 6449093, 6628607, 6773191, 6957733, 7109003, 7300050, 7474671, 7673164, 7853640, 8054596, 8231359, 8428344, 8624917, 8814128, 9011759, 9203256, 9410649]
4792I410649K21913J78362K36727K06220K46663K07938K10086J86177K34105J81481
4782A1520321J59403J58037J18641J25799J14947P9527J07708R4217P0276Q6239
4772A2635115K4284J4886j0743P376k555k5536o1779n8145o0942p6931o4217j27368
4760A2193445r4962j29328j41153j29997j36590j45078j46517j62974j39115j60584
4750A0807147j49143j83716j29187j85395j54115j70966j64165j66386j59399
4741I344675j62970j50213j44349j94088j64255j44020j73105j57160j46850j48351
4731G759314j73310j27507j63749j40394j65624j31929j44429j45740j44646j53550
4721F268436j01544j42194j21410j49974j09023j23983j04679j25389j00686j50940
$$ y = [9410649, 9632562, 9810924, 10047651, 10253871, 10500534, 10708472, 10918558, 11104735, 11338840, 11520321, 11679724, 11837761, 11956402, 12082201, 12197148, 12276675, 12384383, 12478600, 12548876, 12635115, 12659399, 12674285, 12663542, 12670918, 12668363, 12642827, 12581048, 12522903, 12461961, 12385030, 12320813, 12193445, 12098483, 11969155, 11828002, 11698005, 11561415, 11416337, 11269820, 11106846, 10967731, 10807147, 10658004, 10474288, 10345101, 10159706, 10005591, 9834625, 9670460, 9504074, 9344675, 9181705, 9031492, 8887143, 8693055, 8528800, 8384780, 8211675, 8054515, 7907665, 7759314, 7586004, 7458497, 7294748, 7154354, 6988730, 6856801, 6712372, 6566632, 6421986, 6268436, 6166892, 6024698, 5903288, 5753314, 5644291, 5520308, 5415629, 5290240, 5189554, 5038614]
4711E038614j07262q4433j00885j13174q1453r1019r5013r4524j24802p2922q1790
4700C991337q6199n8835r1055r3986l0608p3569p6984o4334l6901m5793p3519
4689C259554j3638j3475J7427P2217J79439J44081r778k32096k28137j37963j32724
4678B904907j02313q0335m7150o4558m6542o9190k8967m6842l1584q9465p324
4667B290637o4657l205k7874l3181j714m3676p11j1698K0724J2297n060l200m0508
4654B088174n4626j5726J5613J7602k6382q773k890j6498L169p141J956K5188
4642B019666K3227N7425m6184J9914j0363k0317o08k9146k6838k0155j3061p769
4630A945791N0658k5700M096j773M455K7091Q3608J23222J84795J54138K63201
$$ y = [5038614, 4931352, 4846919, 4746034, 4632860, 4551407, 4460388, 4365375, 4270851, 4146049, 4073127, 3991337, 3905138, 3846303, 3755248, 3661262, 3630654, 3557085, 3480101, 3415767, 3378866, 3333073, 3259554, 3245916, 3232441, 3249868, 3322085, 3501524, 3645605, 3635827, 3403731, 3175594, 3037631, 2904907, 2802594, 2722259, 2675109, 2610551, 2564009, 2494819, 2465852, 2419010, 2387426, 2297961, 2290637, 2225980, 2222775, 2194901, 2161720, 2160006, 2116330, 2115619, 2103921, 2124645, 2136942, 2131882, 2128682, 2088174, 2033548, 2017822, 2033435, 2051037, 2024655, 2015882, 2012992, 1996494, 1999663, 1992522, 1994478, 2019666, 2042893, 2100318, 2054134, 2074048, 2063685, 2043368, 2042760, 2013614, 1986776, 1966621, 1953560, 1945791, 1996449, 1970749, 1974845, 1973072, 1977527, 2004618, 2088226, 2211448, 2396243, 2550381, 2813582]
4619B813582K68798M6897j85196k15794j83057j43620j45111j04872r5236l8562
4609B017829m0285l5417k9003L1985n645j1903K1539L4214N3057J44261J80845
4598B361477L30142L19238L6386j44928k22694j67995j72646j34278p2851p4339
4588B057512l8596l0738n311K2066j539m3949j2596k2743l1641k882O444L6132
4576A932159L5733M4779L5878L0045K3450P392k7820k9789R5j7131J0002L3371
4564B078164J8313M3543M833K1686j3553L449L1641N3430L6559L8670O187P6304
4552B399226N3912P6487N0240N7215P9103R6795J59797J02269m4076o5883q3890
4541B881195K9957l5977K3617K7773K9783L7824L0449K8458J2690O4810L2326
$$ y = [2813582, 3082380, 3129277, 2944081, 2728287, 2545230, 2401610, 2256499, 2151627, 2056391, 2017829, 1977544, 1942127, 1913124, 1945109, 1939464, 1927561, 1949100, 1983314, 2036371, 2180632, 2361477, 2691619, 3010857, 3047243, 2902315, 2679621, 2511626, 2338980, 2204702, 2131851, 2057512, 2018916, 1988178, 1982867, 2004933, 2003394, 1959445, 1946849, 1924106, 1892465, 1889583, 1896027, 1932159, 1967892, 2012671, 2048549, 2078594, 2102044, 2109436, 2081616, 2051827, 2051922, 2034791, 2044793, 2078164, 2096477, 2140020, 2144853, 2166539, 2152986, 2156435, 2188076, 2241506, 2278065, 2316735, 2322922, 2399226, 2453138, 2529625, 2579865, 2637080, 2716183, 2812978, 2972775, 3075044, 3030968, 2965085, 2881195, 2911152, 2875175, 2898792, 2926565, 2956348, 2994172, 3024621, 3053079, 3065769, 3130579, 3162905]
4530C162905N6871P2209K0873P0697K9365P5582P2750P9641J15291J67911K36158
4519D160253L47659M36243L56126K0371p6978p5788r2891m0190L0219K0924N1407
4508E137355M8508J2004R2948O9878J42389J50642K03538K31724K10345K33269
4498F532600K98575L34852L80242L64778J67594J58240K13694K76565K42955K07392
4488I177487N0241j5416J5518L2037P5623J29614J34166K11196K23690K15579
4478A0249735K32565K75645L39325L79340M18114M54557N84187N43134N84753
4469A4061355O16912N88896N62194N16729M69529M00631L46442K37792J19141
4460A7919621Q730J5434m3814j181P465J46594J36116j57851l15160k37889p7358
$$ y = [3162905, 3219776, 3291985, 3312858, 3383555, 3412920, 3488502, 3561252, 3640893, 3756184, 3924095, 4160253, 4507912, 4944155, 5300281, 5320652, 5243674, 5167886, 5074995, 5034805, 5065024, 5085948, 5137355, 5185863, 5197867, 5290815, 5360693, 5503082, 5653724, 5857262, 6088986, 6299331, 6532600, 6831175, 7166027, 7546269, 7911047, 8078641, 8236881, 8450575, 8727140, 8970095, 9177487, 9227728, 9212312, 9227830, 9259867, 9335490, 9465104, 9599270, 9810466, 10034156, 10249735, 10482300, 10757945, 11097270, 11476610, 11894724, 12349281, 12933468, 13476602, 14061355, 14678267, 15267163, 15829357, 16346086, 16815615, 17216246, 17562688, 17800480, 17919621, 17928351, 17943785, 17899971, 17898790, 17906255, 18052849, 18188965, 18031114, 17715954, 17478065, 17400707]
4449A7400707N3182R4352J91640K18913K37489K00092J48362K14517J49381J41974
4439A9050609J09466L8517k0240o5572j21339j66466j50350j52568q8507j57282
4429A8276268k07410j88328n8294O4234K53067K67856K42142K36648K55853K83069
4419A9425105K51192J49896J28368J37673J69693J73552P8826J85882L22643M73786
4409B1496616N75568P62374R92864R00224M82863K05753M18835N70102L72701
4400B6777900M17961O27552Q72875J112569J325531J715873J994982K170018K810775
4391C9826036M389060P097076R422789P150365M16115j672191j339503k593986
4383F2695761m105292l901745k692144j361301j96927J016392K230322L009550
$$ y = [17400707, 17453889, 17548241, 17739881, 17958794, 18196283, 18396375, 18544737, 18759254, 18908635, 19050609, 19160075, 19198592, 19178352, 19112780, 18991441, 18824975, 18674625, 18522057, 18433550, 18276268, 18068858, 17880530, 17822236, 17886470, 18139537, 18407393, 18649535, 18886183, 19142036, 19425105, 19676297, 19826193, 19954561, 20092234, 20261927, 20435479, 20514305, 20700187, 21022830, 21496616, 22072184, 22834558, 23827422, 24727646, 25210509, 25416262, 25835097, 26405199, 26777900, 27195861, 27823413, 28696288, 29808857, 31134388, 32850261, 34845243, 37015261, 39826036, 44215096, 51312172, 60734961, 67885326, 68301441, 66629250, 65289747, 62695761, 58590469, 54688724, 51996580, 50635279, 50438352, 51454744, 53685066, 56694616]
4375E6694616L474995L948346N300348P758390J1830095J9404468L5224889N8453840
4367B02089987O2568851J2703730l9659895l9138627k8789138k5410701k0550097
4360A23814110j5602983j3434649j0246834o753589m051020j966950m43610O81537
4352G1996012K021908L967876O533866J0538103J8866124L5343734N4488862M6510179
4344B50266664q097126l8209929k7411422k1106877k4575525k0822645j4961968
4337I5081172j2615713r494409n302811j156844K123824M44092n295576o155693
4329E7628042m995695l680639k449693j353809m72715J19279J039856L162926
4321D8997552N941309O240315j10480n786730m922000k818298j061561N78096
$$ y = [56694616, 60169611, 64117957, 69418305, 77176695, 89006790, 108411258, 143636147, 202089987, 264658838, 277362568, 237702673, 198564046, 169774908, 144364207, 123814110, 108211127, 94776478, 84529644, 77776055, 73725035, 71758085, 71314475, 71996012, 74017920, 77985796, 84519662, 95057765, 113923889, 149267623, 203756485, 250266664, 242169538, 203959609, 176548187, 155441310, 130865785, 110043140, 95081172, 82465459, 72971050, 67668239, 66511395, 68635219, 69079311, 63783735, 57628042, 52632347, 48951708, 46502015, 45148206, 44675491, 44794770, 45834626, 48997552, 54938861, 61179176, 61068696, 55281966, 50359966, 47541668, 46480107, 47058203]
4313D7058203L089250N791856N154244n89068n325727m372950k497101j165529
4305D7143178r1539Q90597K123862L625437N704845R840265J7954541K9107857
4297A16299043K9997090N287307j8434080j9359657j7120586j3507781p898133
4290G5263203l073842j229004l239944m538850k947770j80163J857458L31209
4282F2242297j651388j35986J451418K677453L530337M153997M844745N921387
4274H3034260P866924J1306837J8495003L3862390N6010195N8499769O491896
4267B75567274m2404780m1831542l7696899k9530644j8054959q848766n332023
4260I1867661q115994r590063p280798m747706k537180k010678k903191k172442
$$ y = [47058203, 50147453, 55939309, 61093553, 60504485, 55178758, 50805808, 48308707, 47143178, 47051639, 47942236, 50066098, 53691535, 59396380, 69236645, 87191186, 116299043, 146296133, 151583440, 133149360, 113789703, 96669117, 83161336, 75263203, 72189361, 70960357, 67720413, 63181563, 60233793, 60053630, 61911088, 62242297, 60590909, 60454923, 61906341, 64583794, 68114131, 72268128, 77112873, 83034260, 90901184, 102208021, 120703024, 154565414, 210575609, 269075378, 275567274, 233162494, 191330952, 153634053, 124103409, 106048450, 97199684, 91867661, 83751667, 74161604, 66880806, 62133100, 59595920, 57585242, 54682051, 52509609]
4252E2509609j027799r0003P35732J535626K416339L559443N245369P283412R983140
4243H2150868J6000298K4251692K4069436J374678k0961529k1597880j8863381
4236H6424182j4740920q970516m393384k616695l696932m485728l595710k620513
4228D1303784k083336j795761j806040j633020j522392j321321r44390m32966
4220B9764558P3496O85632R78165Q87971L27859o58897j622835j828675j388812
4211B7218462j040627p43021m24272j64162J63497L65711K51788k25349m45557
4202B4956470j90168K03464K05415k36214o72975r65141j073621j065135j010398
4193B0151697r39997o99008j29682N57864J083060O20588p12231j486239j323303
$$ y = [52509609, 51481810, 51391807, 52127539, 53663165, 56079504, 59638947, 64884316, 72167728, 82150868, 98151166, 122402858, 146472294, 147846972, 126885443, 105287563, 86424182, 71683262, 62712746, 58319362, 55702667, 52005735, 47520007, 43924297, 41303784, 39220448, 37424687, 35618647, 33985627, 32463235, 31141914, 30197524, 29764558, 29838054, 30523686, 31501851, 32389822, 32717681, 32058784, 30435949, 28607274, 27218462, 26177835, 25434814, 25010542, 24846380, 25009877, 25375588, 25627376, 25402027, 24956470, 24766302, 24969766, 25175181, 24938967, 24265992, 23300851, 22227230, 21162095, 20151697, 19211700, 18512692, 18383010, 18940874, 20023934, 20644522, 19932291, 18446052, 17122749]
4184A7122749r45169o66484m33009k17953J8686J61877M36273O21492P14457L61345
4174A7174264m19628r90545j114927r49730p05362m85264m78798o67925o65572
4165A0696513o02176m60124k26119K4258L13328L56235M215n95930q09200o87838
4155H013162n50978m11353k55710j58954p1823j23550k23608k95970k73542k09617
4145E438057j20140o4464l9078q454K2621K3721j16302j97226k28817j90525r6043
4134D423350o0151q6201p4887q9391j03226q8230j52013m5149r3916o4360p0484
4123C495342p4459k4150n6163l4817k4835l0815J2494K6545R5436J99974K92336
4112C876888K35535n1545k15863k62757k15014j80989j47156j50759j00854r4621
$$ y = [17122749, 16177580, 15511096, 15078087, 14860134, 14878820, 15040697, 15476970, 16098462, 16812919, 17174264, 16754636, 15764091, 14649164, 13699434, 12994072, 12508808, 12030010, 11362085, 10696513, 10094337, 9634213, 9408094, 9432352, 9745680, 10101915, 10106130, 9510200, 8701000, 8013162, 7462184, 7050831, 6795121, 6636167, 6564344, 6440794, 6217186, 5921216, 5647674, 5438057, 5317917, 5253453, 5214375, 5205921, 5228542, 5252263, 5135961, 4938735, 4709918, 4519393, 4423350, 4363199, 4276998, 4202111, 4112720, 4009494, 3921264, 3769251, 3724102, 3630186, 3565826, 3495342, 3420883, 3396733, 3340570, 3305753, 3280918, 3250103, 3262597, 3289142, 3384578, 3584552, 3876888, 4112423, 4060878, 3845015, 3582258, 3367244, 3186255, 3039099, 2888340, 2787486, 2692865]
4102B692865m2865m8686o9834j7168j1230j7751J9615n937L5010J25447K01842
4091B861308K49858J38228j26427j75520j69450r8680j18601j22828r5790q9234
4081B252864n1709p1548j8294k1094N664k9034j6986j1319J7196k2923k1158k1807
4069A989852j8844m4755J2598K5773J2073l2638m5866j277k9966j9183J3089j4261
4057A846595K2476m964L6952l6055r474j2890K8927m67P2277Q9821J77848K35491
4045B446537J20484m586j42826r2571j75333j09147l2219k9933k5342o6117j059
4034A887888k9838O137R747K1610k0763p105K483J2395K8251M9146K0751M0170
4022B020872L0217J10952J55556L25665L79020J44624j44015j92226j67482j38304
$$ y = [2692865, 2650000, 2601314, 2531480, 2514312, 2503082, 2485331, 2504946, 2499009, 2534019, 2659466, 2861308, 3111166, 3249394, 3122967, 2947447, 2777997, 2679317, 2560716, 2437888, 2342098, 2252864, 2201155, 2129607, 2111313, 2090219, 2095883, 2066849, 2049863, 2038544, 2055740, 2032817, 2011659, 1989852, 1971008, 1926253, 1938851, 1964624, 1976697, 1944059, 1898193, 1896916, 1866950, 1847767, 1860856, 1846595, 1869071, 1864107, 1901059, 1865004, 1855530, 1842640, 1871567, 1871100, 1943377, 2033198, 2211046, 2446537, 2567021, 2562435, 2419609, 2327038, 2151705, 2042558, 2010339, 1980406, 1955064, 1888947, 1887888, 1858050, 1864187, 1873934, 1895544, 1874781, 1867676, 1870159, 1882554, 1910805, 1959951, 1980702, 2020872, 2051089, 2162041, 2317597, 2643262, 3022282, 3166906, 3022891, 2830665, 2663183, 2524879]
4012B524879j09829q7986j480m9986k4008j1322j0018J4189J9032M8138k6883
4001B284726J7443r399k831j4458K2960K7940J7176M5363P5821R1816J45869J52327
3989B854753Q7718p9296p3403o1720R588J8720N3602R7980J03471J09271J30168
3978C250852P6522n1347j63245j54423k25392j35642j49204q1858n4315k3221
3968B288727r607j8979N9047K0881L4322N5972J7543J7464J7187K4253L0232M4417
3956B581459N1730N0653l0567l350n9900l8969o4464j04533j38387j16712p9065
3945B047895q1748n7070n6314j5312J3225j5627k1454J5918k8750q403k0569l7725
3933A734066o4331p0955k275n4557p2190n3813o5816p2377m2367n1007j0444p5532
$$ y = [2524879, 2415050, 2327064, 2325584, 2275598, 2251590, 2240268, 2230250, 2244439, 2263471, 2311609, 2284726, 2302169, 2292770, 2289939, 2275481, 2298441, 2326381, 2343557, 2388920, 2464741, 2556557, 2702426, 2854753, 2942471, 2863175, 2789772, 2728052, 2737640, 2756360, 2809962, 2907942, 3011413, 3120684, 3250852, 3327374, 3276027, 3112782, 2958359, 2732967, 2597325, 2448121, 2366263, 2311948, 2288727, 2279120, 2260141, 2319188, 2340069, 2374391, 2430363, 2447906, 2465370, 2482557, 2506810, 2537042, 2581459, 2633189, 2683842, 2653275, 2649925, 2590025, 2551056, 2486592, 2382059, 2243672, 2126960, 2047895, 1966147, 1909077, 1852763, 1837451, 1850676, 1835049, 1813595, 1829513, 1800763, 1792360, 1771791, 1734066, 1669735, 1598780, 1596505, 1541948, 1469758, 1415945, 1350129, 1277752, 1235385, 1184378, 1173934, 1098402]
3921A098402m1966j0423m7012l2262r534k0189l2735n840k4440n334r256l0779
3909H28632k1567K4925k3817k5917o370k5151n1091P699k4837j3436J0336j1202
3897F68204k5220l2394m367j4843J1563l9397k300o903m0934k536J7685j3744
3885E14814j0378j0464o669k302M810J5126l9386K88J875k7238L7865n7992K4377
3872D44726k7706J3066m1599K290M649q873l6495l490J2343m883j9465q88J1124
3859C44799R130k8680J6993k2958j2703O122J4168K807j5818R589k3774L765r931
3846B93509J210n679R15k3917K367j1730n821p652j0059L9540j736l0677Q210
3833B48480k5280K0894k1552K2503O514k3191j6617J8266k7694J5487k9765L6983
$$ y = [1098402, 1056436, 1046013, 999001, 966739, 957205, 937016, 904281, 898441, 874001, 868667, 859411, 828632, 807065, 831990, 808173, 782256, 775886, 750735, 699644, 707343, 682506, 669070, 679406, 668204, 642984, 610590, 606223, 591380, 602943, 563546, 561246, 554343, 513409, 510873, 528558, 514814, 504436, 493972, 487303, 485001, 489811, 504937, 465551, 465839, 467714, 440476, 478341, 420349, 444726, 417020, 430086, 388487, 390777, 395426, 386553, 350058, 346568, 358911, 354028, 334563, 333675, 344799, 353929, 325249, 342242, 319284, 306581, 312703, 326871, 329678, 313860, 323449, 299675, 303440, 293509, 294719, 289040, 289955, 266038, 268405, 256675, 250854, 243202, 233143, 272683, 270947, 240270, 248480, 223200, 244094, 222542, 245045, 251559, 228368, 211751, 230017, 202323, 217810, 188045, 225028]
3821B25028k1410m261j6188P924q108J3882P623p981j2040j9382K042M262l2547
3808A38844K2862K2093m1890J4863k6191J5999l5663J2234J0267j6876P389k7701
3796I6230n478K5491R359m10m269L7306k2987M1227m8388k2799j291M529N42J0884
3782A19946L206j6046k1937J8427j7617o159K1026j7133L4351J3814j4723k1247
3770I5908P241P590K9427k4518j5408k9386N609l0928R268j191J1596K8296p675
3757H5829o193J4800j7630k4549Q465O333J9364K6043j8414J7504l6450J2502
3745H7604n1325J7238J7336j1356k7699J3922m9j994J8116J7737K1197l5166j2846
3732E2715j6496K941k920J7513j8381J5168J7658L343q574M136j8605k862J5657
$$ y = [225028, 203618, 199357, 183169, 191093, 182985, 196867, 204490, 196509, 184469, 165087, 167129, 171391, 138844, 161706, 183799, 141909, 156772, 130581, 146580, 110917, 123151, 133418, 116542, 123931, 96230, 90752, 116243, 125602, 125192, 120923, 158229, 135242, 176469, 128081, 105282, 103991, 108520, 109062, 119946, 123152, 107106, 85169, 103596, 85979, 79820, 100846, 83713, 118064, 131878, 117155, 95908, 103149, 110739, 140166, 115648, 100240, 70854, 76463, 45535, 54803, 53612, 65208, 93504, 85829, 79636, 94436, 76806, 52257, 60722, 67055, 86419, 112462, 94048, 111552, 75102, 87604, 36279, 53517, 70853, 59497, 31798, 45720, 45671, 43677, 61793, 79530, 100727, 65561, 52715, 36219, 39160, 36240, 53753, 35372, 50540, 68198, 71541, 62967, 67103, 48498, 45636, 61293]
3719F1293j8253K2799O852K938m1854L7495l9727J7636K681K0857j2001L611j8906
3706D5421p248K562K8507K0414r994l9153j1772r01P477K6111j3637P911k5398
3693C0300L2005K4243k3858k8185l0436Q713L6553k7278J1335J1192R427l8164
3681A5847j2321l515l507m615j731J9062J5891J4062l3309P457J0515K8867l3589
3668A9114j1207K503J1781l7223J0981j2982R868n232r32j4675k526n624M1394
3655E240k8572l4759K199N2870J2738m4614k8376M67J809L8702J5573l1250K3928
3642a4045j1672j8867J5992k7941J3501m500Q865n355J6924j8801R135o958K5173
3629a8549k7344j5749J2259L488l925K0572n105k6340J2239j4138q573J799K4494
$$ y = [61293, 43040, 65839, 72691, 75629, 33775, 71270, 31543, 49179, 51860, 72717, 60716, 64327, 45421, 38173, 40735, 69242, 89656, 79662, 40509, 28737, 27836, 35313, 61424, 47787, 55698, 30300, 62305, 86548, 62690, 34505, 4069, 12782, 49335, 22057, 33392, 44584, 54011, 15847, 3526, 11, -3496, -8111, -9842, 9220, 25111, 39173, 5864, 13321, 23836, 52703, 19114, 7907, 10410, 22191, -15032, -4051, -17033, -7165, -12397, -13329, -28004, -30530, -36154, 5240, -23332, -58091, -55892, -3022, 9716, -34898, -63274, -62807, -60998, -22296, -6723, -37973, -14045, -25717, -44584, -28592, -56533, -43032, -47532, -38667, -44022, -27098, -45899, -36764, -43722, -18549, -45893, -61642, -49383, -45895, -49820, -29248, -34353, -60693, -48454, -62592, -71165, -69366, -44872]
3616d4872m2649K0583k9628J3869J4658J6638o530M891k5198P940J4154n601j0771
3603g2516r444J1118K969K199K6424l8810K6432r767J4034P615j3703l186J710
3590e4925m0798J8070l091j623J1741P724j0938O589O097M657j0183l610j0191
3577h0481J159J1583P657k7872J2245l2120K6371L369K899l261K7611J5734m7888
3564h2994l934k405j8695J0086J2722k824K4717j665l972q417P386j8330K6850
3551f1475k2906k3738K9749p376j2842L2215j1281k1742L2568k1694J4283j8357
3539i2596J4876k5636Q057J8566r302o739n616J775k0873K7840k771q993L442
3526i7970k1075J7758k117K3653k0551P366o73J5209j6823m531Q961K2422J5360
$$ y = [-44872, -87521, -66938, -96566, -82697, -68039, -51401, -57931, -53040, -78238, -70298, -56144, -61745, -72516, -81960, -70842, -67873, -65674, -39250, -78060, -51628, -61395, -47361, -39746, -53449, -56635, -54925, -95723, -77653, -80744, -82367, -70626, -62902, -73840, -67251, -61154, -56497, -66680, -70290, -80481, -79322, -67739, -60082, -87954, -75709, -107829, -81458, -78089, -75190, -78451, -50840, -35106, -82994, -86928, -89333, -108028, -97942, -85220, -88044, -63327, -64992, -68964, -77381, -69995, -88325, -61475, -84381, -108119, -78370, -85746, -98588, -66373, -77654, -99396, -66828, -88522, -74239, -92596, -77720, -103356, -95299, -76733, -86035, -92774, -98390, -96615, -117488, -89648, -92419, -101412, -97970, -119045, -101287, -103404, -79751, -100302, -92936, -93609, -78400, -95223, -99754, -90793, -68371, -53011]
3513e3011J0337j3375l8365J3989Q697l0181J2891J0632j0578p741J2152j2702
3501i7255j3248J461J1415j7542K7716j5582L629l748K4814k8634J1462l859j068
3488a00439J3046K12J2610P846k1674q758K201M953k1962J9173N344j9r855j9543
3474a16865L0721l344j02O804j3021o480J3568J798O130m6911L1222j0217N964
3461a00733j0159K707m02j0648Q849L560m057o999J5362P704j7218K536n082L895
3447a10685k22j2896L5627l6478K4404k4762p529M776J4841k4404j3688K7886
3435a23130K380J6531M036k643m7348K4918q283K4875k4263J0515M697m05M351
3422a13769K605j364p970J272J1975M640k0418o47K6305k1275J206n675J5333
$$ y = [-53011, -42674, -56049, -94414, -80425, -71728, -101909, -89018, -78386, -88964, -96705, -84553, -97255, -110503, -109042, -97627, -115169, -87453, -103035, -99406, -103154, -78340, -106974, -95512, -99371, -100439, -87393, -87181, -74571, -66725, -88399, -97157, -94956, -90003, -111965, -92792, -87448, -87467, -97322, -116865, -86144, -89488, -89590, -82786, -95807, -102287, -88719, -86921, -80791, -127702, -96480, -106697, -100733, -110892, -108185, -108587, -119235, -110386, -106826, -110883, -117882, -102520, -94816, -112034, -109498, -114580, -110685, -110907, -123803, -88176, -124654, -100250, -125012, -132541, -127765, -112924, -137328, -151016, -123130, -120750, -104219, -100183, -102826, -150174, -125256, -133539, -108664, -132927, -122412, -117715, -118120, -113769, -111164, -112528, -120498, -119226, -107251, -102611, -123029, -123676, -97371, -118646, -117440, -123115, -107782]
3409a07782J0434k4938J4686J1764j7249K8363O240l1117P726n750J1934j690
3397i7379n500K4674j5223r924K774O11K8948j9793L988J0517K5436k8269K1558
3384e7582K4733O2443L9071o6730l8497l5013K584L090j6813m59l874l4485N9704
3371f1828j9268l1415M8282l7131K1613o584k043R828J0294j9693K5519j0826
3359g3252K9671j2158J6833N903j297K6237q563k89J3415K5103j4893M3584L906
3346E4200N0635J7961O9687J81062J89029J79593m7874k04463j55503j14543r0230
3335A29554q2115m221l7159m0485K7402k8833k397n616J4439J6102l5941R041
3323d0229J5011k3985O657j7470j2909J5602l970l802J8079L692J3134k820O016
$$ y = [-107782, -97348, -122286, -107600, -95836, -113085, -84722, -78482, -109599, -101873, -107623, -95689, -97379, -102879, -78205, -93428, -103352, -100578, -99967, -71019, -90812, -86824, -76307, -50871, -79140, -57582, -32849, 29594, 68665, 1935, -36562, -71575, -68991, -65901, -82714, -83173, -87047, -121532, -61828, -81096, -112511, -64229, -101360, -79747, -86331, -88374, -78546, -68252, -87945, -62426, -73252, -43581, -55739, -38906, -33003, -34300, -8063, -16626, -16915, -3500, 21603, 6710, 50294, 54200, 104835, 122796, 192483, 373545, 562574, 742167, 694293, 489830, 334327, 219784, 129554, 47439, 43218, 6059, -34426, -7024, -35857, -38254, -43870, -29431, -13329, -49270, -40229, -25218, -49203, -42546, -60016, -72925, -57323, -61293, -65095, -47016, -43324, -30190, -33010, -26994]
3310b6994j8556K0675m398N806N11L5550j496Q23R017J0688O433j861K5806M3600
3296A05604L2026P1363P5538M2123j5957N141P576L2107N0122J10109J02524K23895
3284H42171K84805O95132J721192K347767k46872k101550j251323o80563m84100
3275A126659l03730k25642j23848j24928q0193k6765j8963M4059r669q5755m2889
3264A28336n2486m2735J8156o029k9361L980k2702r752J8828l4422L516k6078
3252e0749J4891j4161k454r251n595R510O089j4931l937j9552J5093j2222Q129
3239g9140k5765K5590k6614L0869o156k1300n09j2443P540j6778J2022j258m293
3226a18235Q170o865j4617J3584M759J2333j3794P524n971r224l5889J9568J1026
$$ y = [-26994, -45550, -24875, -29273, -23467, -22956, 12594, 11098, 11921, 20938, 31626, 38059, 36198, 62004, 105604, 137630, 208993, 284531, 326654, 310697, 315838, 323414, 355521, 405643, 515752, 618276, 842171, 1126976, 1822108, 3543300, 5891067, 5644195, 3542645, 2291322, 1610759, 1126659, 822929, 597287, 473439, 348511, 268318, 241553, 222590, 266649, 256980, 171225, 128336, 75850, 33115, 51271, 45242, 15881, 19861, -2841, -12593, 6235, -28187, -24671, -50749, -35858, -50019, -52473, -61724, -67319, -57809, -51720, -66651, -70588, -90140, -75047, -87269, -79140, -104905, -79315, -105929, -75060, -81216, -102516, -103025, -115468, -107928, -124706, -112684, -113942, -118235, -110065, -116930, -131547, -117963, -113204, -100871, -114665, -107141, -113112, -122336, -158225, -138657, -127631]
3213a27631K105R35p736k8924R334P291O184O479r561p068k1058M0027k9239J9234
3199a39628l512j0402K1959N78j3379k1565j2028J5791m885L5789m222m0692l683
3186a79879J4062O439N555j0508O927J3564k2903K368K756J6722k4769J65J7531
3173a51970j1780k1079K5012r217m257J1658M16l505k284O578k3760K0076k9571
3160a93683K6401j0273l046K6698J579N987j5922j1011J915O570J2623j0063M997
3147a57228n162k4452K884L3139j0019k0199R948K2752j5979p292K011j9971M684
3134a84884K2780N057p077J0229l8246j447q567M3228k4337J8097j7084q860J1133
3121a79978p84k2355K5403k118k6490o119L0919j4367L703l49L193p913K0481
$$ y = [-127631, -125526, -124591, -132327, -161251, -151917, -144626, -138442, -131963, -141524, -148592, -169650, -129623, -158862, -139628, -143140, -153542, -131583, -131005, -144384, -165949, -177977, -162186, -167071, -131282, -135504, -176196, -179879, -165817, -159378, -153823, -164331, -157404, -143840, -166743, -164375, -161619, -144897, -169666, -169501, -151970, -163750, -184829, -159817, -169034, -173291, -161633, -161217, -164722, -167006, -160428, -184188, -164112, -193683, -167282, -177555, -180601, -153903, -152324, -146337, -162259, -173270, -171355, -164785, -152162, -162225, -157228, -162390, -186842, -183958, -150819, -160838, -181037, -171089, -148337, -164316, -171608, -169597, -189568, -184884, -162104, -157047, -164124, -153895, -192141, -193588, -202155, -158927, -183264, -165167, -182251, -191111, -179978, -180762, -203117, -177714, -179832, -206322, -212441, -181522, -195889, -192186, -192535, -189342, -197255, -176774]
3108a76774o617K3978o028j782j0142J605k3982n38K7028k2291Q790J783q817
3095a93787k6581J7562K7474M96J1286l3246J6667j6015P907J6919l6782J9937
3083a88163l548R475l66J6048j0269N015j8303M437J961R330j2502J0279j4419
3070a91025j5206Q376k914J4360K2999j3297k3547L682j1556k896J9180Q473J1659
3057a71712m4520J4670K4608j4930o667p838L767L0091J3333k7648R880O889J8717
3044a51360k2368K2413R94j6632l812N385j8128k0723p895J1041L886p084P622
3031a96661J4146j6495j7105J236K8500l632L663n367j0477J8889k1011j6884
3019b21198K2668j7687J8164j241J3345K672k300j1084p922J5008n204R780L220
$$ y = [-176774, -183391, -159413, -165441, -167223, -177365, -175760, -199742, -200280, -173252, -195543, -186753, -184970, -193787, -220368, -202806, -175332, -174836, -163550, -196796, -180129, -196144, -188237, -171318, -208100, -188163, -191711, -182236, -182602, -166554, -176823, -171808, -190111, -185674, -183713, -174383, -186885, -176606, -191025, -206231, -197855, -200769, -186409, -163410, -176707, -200254, -196572, -208128, -211024, -191844, -183371, -171712, -216232, -201562, -176954, -191884, -198551, -206389, -202622, -172531, -159198, -186846, -176966, -170077, -151360, -173728, -151315, -150321, -166953, -170765, -165380, -183508, -204231, -212126, -201085, -197199, -204283, -196661, -182515, -199010, -216115, -214879, -186379, -190011, -186348, -191715, -202192, -183303, -204314, -221198, -198530, -216217, -198053, -199294, -185949, -183277, -185577, -196661, -204583, -189575, -194779, -184999, -181779]
3006a81779m493J4414k2247k0038L8483j7352P309n76J286j9812O437R895r949
2993a98422o56R611k8335P484J4469q637J091K1416k4184p269J9606M09J3876
2980a79541l6279K3800O224k8773J2834L5116j0295j170m798j6298m523J0971
2968a92732j3377J6881j5884R402J678p97N679k3492J9994j0725J2566k205J0823
2955a82189k4524l331M957j162o079K6330p8L114j0921k5844q826P709J8193J1359
2941a91292m794j20q34j8762j0198j0512J6062M605Q631P187L0676k6010O644
2928a88717j709l305m089L65j2991J8768k8574J7171k0730P693J3350q91P731
2915a95928j5805O540J6438j7131Q940j427l4547K8974J7917p247q925k935m551
$$ y = [-181779, -186272, -171858, -194105, -214143, -175660, -193012, -185703, -186279, -184993, -204805, -198368, -188473, -198422, -199078, -189467, -217802, -210318, -195849, -204486, -203395, -181979, -206163, -213432, -193826, -193417, -179541, -215820, -192020, -185796, -214569, -201735, -166619, -176914, -178084, -182882, -199180, -203703, -192732, -206109, -189228, -205112, -195710, -194032, -194829, -189150, -212642, -192648, -203373, -190807, -193012, -182189, -206713, -210044, -205087, -206249, -212328, -185998, -186076, -182962, -193883, -219727, -228553, -220844, -202651, -191292, -196086, -196206, -197040, -215802, -226000, -236512, -220450, -215845, -207214, -200027, -169351, -195361, -188717, -190426, -193731, -197820, -197455, -210446, -191678, -220252, -203081, -223811, -216118, -202768, -203659, -195928, -211733, -205193, -188755, -205886, -196946, -198373, -232920, -203946, -186029, -193276, -202201, -205136, -209687]
2902b09687J2265k9916K6793k112j7611L161J6558M476j6864R614J3476p601j2413
2889b09861J5530Q511l4839k989J0427k253J0905k7404J1386L88j542M297N640
2876b11804K46J5669p752q598J0857k2587m84N046M124J4525M446k0824L9455
2863a77681k3848L138n168J138k2235J6617o191L449J9129K091j2460R328k7408
2850b20101O956L446j0747J7835R907j1966k3708K1297k0183J4968L788j300p31
2837b10539o781J4152J3958r59k4616M555l3772K2311K1241J772j3179K5902l4604
2824b20559J5041k5199L8602j7908n256j9525K3973l1993M809K8920m865J3122
2812b00838p673J7097p529j9286L194O014j9730K2364M527j3134J996r756J6363
$$ y = [-209687, -197422, -227338, -200545, -202657, -220268, -217107, -200549, -196073, -212937, -203323, -189847, -197448, -209861, -194331, -185820, -220659, -223648, -213221, -215474, -204569, -231973, -220587, -220199, -221741, -217444, -211804, -211558, -195889, -203641, -212239, -201382, -223969, -224453, -219407, -215283, -200758, -196312, -217136, -177681, -201529, -198391, -203559, -202421, -224656, -208039, -214230, -210781, -191652, -189561, -202021, -192693, -220101, -213145, -209699, -220446, -202611, -192704, -204670, -228378, -207081, -227264, -212296, -208508, -209808, -210539, -217320, -203168, -189210, -190169, -214785, -210230, -244002, -221691, -200450, -198678, -211857, -185955, -220559, -205518, -230717, -192115, -210023, -215279, -234804, -210831, -242824, -238015, -209095, -213960, -200838, -208511, -191414, -198943, -218229, -215035, -209021, -228751, -206387, -201860, -214994, -212998, -222754, -206391]
2799b06391Q988J0065l1228M937J2886k8117L8573k2168j3796K7761J531k1883
2787b18842k834j3442K7166p838j5914J3243R922j4403L337L0055l0187P77Q9
2774b18871K1661j7930j1933R455J9122k906j2814P62m754j3041k043K206J9910
2761b11176R262l710p575J5411k5849K0235k3382K1849l0177K6379k7222J3537
2749b22418K2935o427r10L153j3403J0212N430j7484j3615K4060j6382K7305k4209
2736b21753q204P269J2612m761J551n384j8599Q536q159L5473k7163J0502L043
2723b15037K8297k1946j6863J8363n733J1870j9656K2118j6866J5057q508n127
2711b14031q188J362K1487n101j9108J3308q254m138j607J699J6995o988l673
$$ y = [-206391, -197403, -187338, -218566, -213629, -200743, -228860, -190287, -212455, -226251, -198490, -196959, -218842, -221676, -235118, -207952, -215790, -231704, -218461, -208539, -222942, -219605, -189550, -219737, -218960, -218871, -197210, -215140, -227073, -217618, -198496, -201402, -214216, -213454, -218208, -231249, -233292, -231086, -211176, -201914, -205624, -213199, -197788, -223637, -203402, -226784, -204935, -235112, -208733, -235955, -222418, -199483, -205910, -206820, -203667, -217070, -206858, -201428, -218912, -232527, -208467, -224849, -197544, -221753, -229957, -222688, -210076, -214837, -213286, -218670, -237269, -228733, -236892, -201419, -228582, -218080, -215037, -186740, -208686, -225549, -207186, -212919, -201049, -220705, -198587, -215453, -200396, -208904, -214031, -222219, -220857, -199370, -204471, -223579, -210271, -218525, -222663, -224270, -222571, -205576, -212564, -216237]
2698b16237j9109Q903K4133j9033k25j0330J7094p722o056j247J5063j0651J1387
2685b14030r219l702Q41j3360L0291N610k0974J4748k0082J5027j6391J2353J1822
2672b07066o151j2162J944J8336m1730M5495k6487M3368n4306Q591J0903j2191
2660b31456J2236L511j0921N775L9219k4138R539k4094J1259j7611J3981J5461
2648a97239j1146q931m853N415Q518l2227J8482K4729l2588J0243k0239m09J0610
2635b29635j4447K1050J6152j877k8135N558p720Q588J8941j6168M935k804m234
2622b29796M414P465n548r49K1124j7820N404j693j44k3978K4063r659r529n10
2608b37156J0313j4109L6653j5661j0789j8993M453M0098j0245O130j5365j9914
$$ y = [-216237, -235346, -226443, -202310, -221343, -221568, -231898, -214804, -222526, -228582, -229829, -214766, -225417, -214030, -223249, -226951, -226110, -239470, -209179, -203569, -224543, -209795, -229877, -214850, -231241, -218888, -207066, -213217, -225379, -223435, -205099, -246829, -201334, -227821, -184453, -238759, -230168, -219265, -231456, -219220, -215709, -226630, -220855, -181636, -205774, -196235, -220329, -209070, -226681, -212700, -197239, -208385, -217316, -222169, -216754, -208236, -240463, -221981, -197252, -229840, -219597, -239836, -240245, -229635, -244082, -223032, -206880, -208757, -236892, -231334, -239054, -230466, -211525, -227693, -222758, -225562, -229796, -225382, -217917, -223465, -224414, -203290, -221110, -215706, -217399, -217543, -241521, -217458, -227117, -236646, -237156, -226843, -240952, -204299, -219960, -230749, -249742, -245289, -205191, -215436, -209306, -224671, -244585]
2596b44585L2229r760K853J0995k390L020j8670Q690k4899K9438r439N920k389
2583b18987j5770p95j0782L033J5276J4979l011k3994Q107j6127J4009J0618J2943
2570b10501P495o295k8723K1565k9091L9653j7028m0938K4892R793k592J0548
2558b21222l181r031q940L3034l2926J1258K1824Q552m9509J8048L959J8445l2749
2545b42438J9503P207m545j4075J6767j6961n044R136l1940K5412j0851L9387
2533b08442j6056O261J1228j2427j5133J5500p236k6501K7048K6396o0585L1680
2521b28267J23M366o029Q028n59J44j3787O124J7104j9470K2504R2l5843J9508
2507b25962o339J7635p878J3700O281j4510n123m832P457j2984J4955j67m950
$$ y = [-244585, -212356, -222116, -219263, -208268, -210658, -207638, -226308, -217618, -242517, -213079, -222518, -216598, -218987, -234757, -235552, -246334, -243301, -228025, -213046, -216057, -240051, -231944, -248071, -234062, -223444, -210501, -203006, -209301, -238024, -216459, -245550, -205897, -222925, -263863, -238971, -229178, -231770, -221222, -224403, -233434, -242374, -209340, -242266, -231008, -209184, -200632, -250141, -232093, -228134, -209689, -242438, -222935, -215728, -220273, -234348, -217581, -234542, -239586, -230450, -262390, -236978, -247829, -208442, -224498, -218237, -207009, -219436, -234569, -219069, -226305, -252806, -225758, -199362, -259947, -228267, -228144, -223778, -229807, -221779, -222338, -222194, -235981, -229857, -212753, -232223, -209719, -209627, -245470, -225962, -232301, -214666, -222544, -208844, -202563, -217073, -222196, -227028, -219571, -232555, -217600, -217767, -222717]
2494b22717j2791K657N23K8906l3038j377K075J7736p920k004R92j8676Q577J1913
2480b25144J6351j489j7381N357N688k4321K0868j330K4525k7583J1p245J3572
2467b18121K5739k7739K0164j0124p690k420j2815J0870j2847L11j5960J8897
2455b31735R009r745P678l761J6833k7307O638R47N768Q312J969N280k6741Q635
2441b28220l813J3096q324J6788j7386K3606k7031J5867l7915K3976k898M235
2429b28019M259l8711M9472j6663J3220k1666K6971j3844N159k1456q99P410J0336
2416b24431M486N181l416Q824n860k0511J6312r679J5211M244k6682j0397J7959
2403b28759j3646r390L1311k5406J6742o535J0813R35o26j4203J553K5864j7134
$$ y = [-222717, -235508, -232851, -232328, -203422, -236460, -237837, -235762, -218026, -225946, -227950, -226958, -245634, -237057, -225144, -208793, -210282, -227663, -222306, -216618, -240939, -220071, -221401, -196876, -224459, -224448, -231693, -218121, -192382, -220121, -199957, -210081, -217771, -220191, -233006, -222136, -234983, -234672, -250632, -231735, -222726, -232471, -224793, -228554, -211721, -239028, -232390, -231443, -225675, -217363, -215394, -210114, -236855, -228220, -232033, -218937, -227261, -210473, -227859, -204253, -231284, -215417, -253332, -229356, -232254, -228019, -223760, -262471, -212999, -229662, -216442, -238108, -211137, -224981, -219822, -241278, -242177, -234767, -224431, -219945, -214764, -218180, -209356, -215216, -235727, -219415, -229094, -213883, -209639, -236321, -246718, -228759, -242405, -251795, -220484, -245890, -229148, -235683, -224870, -223935, -224561, -238764, -237211, -211347, -228481]
2390b28481j6635L7195k815j8230K6497k0730J454r817j2472k793O1715l0905
2378b16017k0202J7488J2372O865l3243K3536k7206k007K3142k496j461k259O793
2365b14695j9178J6560j3080Q59j8842J8793J2466l0593P114o81J2225k781M172
2352b27661R726j1730N631J6827k3485J2677P90j1515j8671Q973J0708J386J1150
2339b15194j0132j5379K3473R050l6067P371j3392K2669Q12J7676k8229m551J3723
2326b28170k925l411J6175j8461J6268j3609M396j0422o249K1010j0526J2155
2314b23769m0149L9718j1105J7324j0026P691j8976O144J822J2860L318m628j9346
2301b39122J6158j0605K9320l1309L1746k6499N20o156k0827N1325k5978K597
$$ y = [-228481, -245116, -207921, -210736, -228966, -202469, -223199, -221745, -231562, -244034, -246827, -185112, -216017, -236219, -218731, -206359, -199494, -232737, -209201, -236407, -238414, -215272, -217768, -219229, -221488, -214695, -233873, -217313, -230393, -229534, -248376, -229583, -217117, -247710, -240596, -241277, -229052, -231833, -227661, -217935, -229665, -224034, -207207, -230692, -218015, -217225, -228740, -247411, -238438, -227730, -226344, -215194, -225326, -240705, -217232, -208182, -244249, -236878, -250270, -227601, -226789, -209113, -237342, -241893, -228170, -231095, -234506, -218331, -236792, -220524, -234133, -229737, -240159, -246408, -225398, -235924, -223769, -263918, -224200, -235305, -217981, -228007, -220316, -239292, -233148, -231326, -218466, -215148, -219776, -239122, -222964, -233569, -204249, -235558, -203812, -230311, -229791, -235947, -256774, -205449, -231427, -228830]
2289b28830J8504j1281j7270J022m450J5617j8461K5450N476k0643O787m179j1655
2276b43913O341p640K3452J533p604K563j191l51J3792j4651K3965J029j2909
2263b15584O039j3165o007j3447J0003Q708j3307J3427j3700R894q295L740j787
2250b33481J4265M578j230n246R77l8176L0692P709j9003o668M1619m1513L4050
2237b11427k9422K399O331J6798l870j1717j249J1557M92j1861K6492q868o660
2224b21005J6316m5384L6609m1212N5417j0755m587k9338K698j349J9420J5563
2212b07607k3272P980o870k355j679J3683L894j5429J0694o438R752N204j570
2199b14013r723K696r401K576j137N073L132o842L0195k8843k030J7718l0762
$$ y = [-228830, -210326, -221607, -238877, -237855, -242305, -226688, -245149, -219699, -214223, -234866, -228079, -232258, -243913, -237572, -245212, -221760, -220227, -227831, -225268, -226459, -226810, -213018, -227669, -203704, -202675, -215584, -209545, -222710, -228717, -242164, -232161, -223453, -236760, -223333, -237033, -227139, -235434, -231694, -233481, -219216, -214638, -215868, -221114, -220137, -258313, -227621, -219912, -238915, -245583, -203964, -245477, -211427, -240849, -238450, -232119, -215321, -219191, -230908, -232157, -220600, -220108, -231969, -205477, -214345, -221005, -204689, -250073, -213464, -254676, -199259, -210014, -214601, -243939, -241241, -242590, -223170, -207607, -230879, -222899, -229769, -232124, -233803, -220120, -216226, -231655, -220961, -227399, -217647, -212443, -214013, -223736, -221040, -230441, -227865, -229002, -223929, -220797, -227639, -197444, -226287, -228317, -210599, -241361]
2186b41361K8375k4483L2467j8903j9709J8448j3797P030K870o978J746q369K0070
2173b22594p743N543L854K850j896l9566K5839J0577K3920k1924J9568J038l5081
2160b35615l636P15K0704k0161P845N646J6991q828r356K3452k7302K0756j3318
2147b22107P737l0940J7998m557J2960j1590L278k850q283L457J246Q346Q861
2134b16444j8520J2698q987j3321J3462m33K3920k4830r087J3298K41j7381L4136
2121b11248q355j4697J706j3562M3736k2151k7218M6883k0764l3607L7608N540
2109b16129Q755l653o558k2392m798K4792m218j2038J5180K316r533L709J05j8722
2095b43184K9609J0548j7648p036J1679p960N907r257L318l295j3750O9K7107
$$ y = [-241361, -212986, -237469, -205002, -223905, -243614, -225166, -238963, -231933, -229063, -236041, -234295, -242664, -222594, -230337, -224794, -220940, -218090, -219986, -259552, -233713, -223136, -199216, -221140, -201572, -200534, -235615, -239251, -238536, -217832, -237993, -230148, -224502, -207511, -216339, -225695, -202243, -229545, -208789, -222107, -214370, -245310, -227312, -231869, -218909, -230499, -227221, -230071, -238354, -234897, -233651, -225305, -216444, -234964, -222266, -231253, -244574, -231112, -231545, -207625, -232455, -241542, -228244, -228003, -245384, -211248, -219603, -234300, -232594, -246156, -202420, -224571, -251789, -204906, -225670, -259277, -221669, -216129, -207374, -211027, -217585, -239977, -244775, -219983, -224201, -236239, -221059, -218743, -228276, -224567, -224462, -243184, -213575, -203027, -220675, -227711, -216032, -223992, -218085, -227342, -224024, -227319, -241069, -241000, -213893]
2082b13893r573j5770J0696O973j6179K1995j1867j861L1950k1983Q724j3155
2070b23943j0819l959R515J5933j7447o212k427Q002L1821o223m3629K884J9417
2057b27087J0648k0749J955r142K1090j3747R873o800l303K103J9298o553K479
2044b19935j1628o756j0579L1143j3003k993K4778q907k317r291L134j6174l976
2031b46504P918K0720k042N333o96J264P100j0670j2425J7206l560p271L417l124
2017b23334J2788J3361m2569M4816k2731o71j968r155j4350K6587P208o277k437
2004b18732J6987m4369M3823k9623J810K688j0861m113K2177M682j4408N349j9700
1991b44290N248M297k577j18K3974q36j8361J5218k0794K0295j0933j178J1919
$$ y = [-213893, -223466, -239236, -228540, -221567, -237746, -215751, -227618, -229479, -197529, -219512, -210788, -223943, -234762, -238721, -229206, -213273, -230720, -236932, -239359, -231357, -199536, -205759, -249388, -246504, -227087, -216439, -237188, -235233, -244375, -223285, -237032, -227159, -233959, -237262, -235159, -215861, -222414, -219935, -231563, -238319, -248898, -217755, -230758, -233751, -208973, -217880, -220197, -229488, -226354, -242528, -246504, -238586, -217866, -219908, -214575, -215271, -214007, -206907, -217577, -230002, -212796, -216356, -223627, -220210, -223334, -210546, -197185, -239754, -194938, -217669, -218340, -220308, -229463, -243813, -217226, -210018, -216295, -218732, -201745, -246114, -202291, -231914, -230104, -227416, -238277, -242390, -220213, -215531, -229939, -224590, -244290, -239042, -234745, -237322, -237440, -213466, -214302, -232663, -217445, -238239, -217944, -228877, -230055, -218136]
1978b18136p762N586J1289j0600O983L893Q928p994l5325M2977m5242L4543K376
1965b08484j5554j4969J8133j5623K3884Q0L576k7514L2409m2782J4347L2739
1953a99758k8255K0561o267N170r114N36j4448J2062p058J653j0782P002j4177
1940b42875K5058J958J6070j3801M146j1842p43N773o820J1790j9564J6109k5734
1927b40475L1762J998k2485J8586K362r491P426j2629j9038l809J7745J4554m894
1914b18388j9999L7795j7902o431j7458q05L1524k1985M481N754K5052k0636l4448
1901b53446K7350K4255k8751O224J261O132J2551k3065M454r031l575P828K0175
1888b07638j0232j1474J0530j599J9191l5757O85J1253j0558J9273L308j1610
$$ y = [-218136, -225898, -220312, -209023, -219623, -212640, -208747, -199819, -207813, -243138, -200161, -245403, -210860, -208484, -224038, -239007, -220874, -236497, -212613, -212533, -208957, -236471, -204062, -246844, -232497, -199758, -228013, -207452, -213719, -208549, -217663, -217127, -231575, -219513, -226571, -224918, -235700, -228698, -242875, -217817, -215859, -199789, -213590, -209444, -221286, -222029, -216256, -223076, -211286, -230850, -214741, -240475, -208713, -206715, -229200, -210614, -208252, -217743, -210317, -222946, -241984, -245793, -228048, -213494, -218388, -238387, -200592, -218494, -224925, -242383, -243188, -211664, -233649, -229168, -223414, -198362, -218998, -253446, -226096, -201841, -230592, -224368, -223107, -216975, -204424, -227489, -223035, -232066, -235641, -227813, -207638, -217870, -229344, -218814, -220413, -201222, -236979, -236294, -225041, -235599, -216326, -213018, -224628]
1876b24628j2303N1591n5528J4056j2069k499J3964j696K8817k5599O216j6195
1864b35873L8736k0806m810r401K0896j5389J6942q521J3591m0665M4776k4877
1852b25401p75L1588l0413l575K4O254k371p020K7534j6941j2701k244L927K1224
1838b10890j0879K372l497O476J2490k4515L4623k0152P496J392j1130l848k5545
1825b45607K4961K2803j6999j7339j5341M577K7882k691n568j3634K2698j0029
1813b24287L575p339J5281o561j495M408n295k1228J8389Q635k0904J9720l349
1800b20450J5855q162m374P391j8097J3185j022L636j9490K5880j0210l5876L8740
1787b12994K770l716j8415J1562N048j0640Q414J5002m4537K5577k882J482p030
$$ y = [-224628, -236931, -185340, -240868, -226812, -238881, -241380, -227416, -229112, -200295, -225894, -219678, -235873, -197137, -217943, -222753, -232154, -211258, -226647, -209705, -218226, -204635, -245300, -200524, -225401, -226176, -194588, -225001, -228576, -228552, -222298, -224669, -231689, -204155, -221096, -233797, -236041, -232114, -210890, -221769, -219397, -222894, -216418, -203928, -228443, -193820, -213972, -206476, -205084, -216214, -220062, -245607, -220646, -197843, -214842, -232181, -247522, -242945, -215063, -217754, -223322, -236956, -214258, -224287, -220712, -228051, -212770, -219331, -220826, -216418, -221713, -242941, -224552, -215917, -236821, -217101, -220450, -204595, -212757, -217131, -209740, -227837, -214652, -215674, -212038, -231528, -205648, -215858, -251734, -212994, -210224, -213940, -232355, -220793, -215745, -226385, -217971, -202969, -247506, -221929, -224811, -223329, -230359]
1774b30359J6220j64J0824j471j7271M792k15j7883K1316j7718J583J0533J357
1761b18456J8318k6279j216Q323J3529k4514K8889j2646L959l051j21l005J8859
1748a97411L3687m9451J9808l6553K2952J6934o063l0699N6K6822P844k7384J5421
1735b04037k0384K5833j0087K3120m5293Q773M4426n0233J4525l6114M2431j7146
1723b24186K6844j9040o931q178L9217l0193m876R160J5470J679K895j4572j9407
1710b32118M2840k6411O158r831N636J891q821N461m706J261j4207Q014j200J0191
1696b15842o08K0630k7449Q611l394K249J891K638o822P122r492K0661k133j0511
1682b12449o583J3475K139j2312r318J5294p151l734j6204L0568J7675j3187j8978
$$ y = [-230359, -214139, -214303, -203479, -204950, -222221, -217429, -217644, -235527, -214211, -231929, -230346, -219813, -218456, -200138, -226417, -227633, -219310, -205781, -230295, -201406, -214052, -210093, -213144, -213265, -216270, -197411, -163724, -213175, -193367, -229920, -206968, -190034, -196097, -226796, -226740, -199918, -192074, -219458, -204037, -224421, -198588, -208675, -185555, -230848, -222075, -177649, -227882, -213357, -249471, -207040, -224186, -197342, -216382, -223313, -231491, -192274, -222467, -227343, -218183, -202713, -201034, -198139, -212711, -232118, -189278, -215689, -209531, -219362, -213726, -211835, -220656, -215195, -219901, -218640, -232847, -224833, -226033, -215842, -216450, -195820, -223269, -214658, -218052, -215803, -213912, -211274, -218096, -210974, -220466, -199805, -201938, -212449, -219032, -205557, -203418, -215730, -225048, -209754, -216905, -220639, -236843, -206275, -188600, -201787, -220765]
1669b20765N84L538n42l581N26J7300J2139l2416j0288K1849j1734O256k326Q595
1655b10865p68P124j9747o772K0164r089P962k933K1379k0332j8702L5915k1140
1642b17804K0328l3364J5026j21J2701l716j4685P648p54J7066o734N23m65j3849
1628b18200O890P326k5300J6783k1571J4865R640K1163k8572j2453Q022l02J0434
1615b11275j1713m936K0439J2857l475l38k2185O27L641K4419j3369J5286l0542
1602b20564O878M855j4874K5329J0673l23k3005j0255K2607o288j5352R414N39
1589b10366J0050l1571K0433J1892p106J1883l292m260R17N791J52j4733J0663
1576a99547k02M907M459l2266N272o7L3499j3190q675n586J646J8298k7984J0325
$$ y = [-220765, -220181, -216643, -217185, -220766, -220240, -202940, -190801, -223217, -233505, -211656, -223390, -217134, -219460, -210865, -211633, -204509, -224256, -231028, -210864, -219953, -211991, -214924, -193545, -213877, -232579, -196664, -217804, -197476, -230840, -215814, -215935, -203234, -206950, -221635, -213987, -214741, -197675, -204409, -203886, -204351, -218200, -211310, -203984, -229284, -212501, -234072, -219207, -209567, -188404, -216976, -229429, -221407, -221709, -211275, -222988, -227924, -207485, -194628, -198103, -198441, -220626, -219999, -216358, -191939, -205308, -190022, -220564, -213686, -208831, -223705, -198376, -187703, -188026, -211031, -221286, -198679, -204967, -220319, -210905, -210366, -200316, -231887, -211454, -199562, -206668, -194785, -198077, -202337, -201420, -195629, -195477, -210210, -199547, -199749, -194842, -190383, -222649, -217377, -217444, -183945, -197135, -205810, -211396, -209750, -191452, -219436, -209111]
1562b09111j1575M879O040M787L371j2018J0939k995K790N335k7481L766J1481
1549b09792J4997k9220J3007J0962N429l882J7151m0054J6045J0841k078j9507
1537b16101J9530l106M385j1543j1878j9715K5426J6462r839J8908l3837Q201
1525b13107p989J0568j3236O543J0640k188N548l312j775R717k8253K8634j1422
1512b09632K5780l0327N775m613n446K1913R088j6051M625L162J195j7824q985
1499b21340J3538k675J671q890R861J7396j7736O420m172K313j319k4059L7243
1486a91749M059j5911q200J0016k3955K4418k8786K9660k6280J8984O652n771
1474b06863J1966L2620m0744j1361K1928j542j5310J5244j1980r583R866K4519
$$ y = [-209111, -220686, -215807, -209767, -204980, -201609, -213627, -202688, -205683, -202893, -197558, -225039, -221273, -209792, -194795, -224015, -211008, -200046, -194617, -198499, -181348, -221402, -205357, -194516, -196594, -216101, -196571, -199677, -195292, -206835, -218713, -238428, -213002, -196540, -206379, -187471, -221308, -213107, -221096, -210528, -223764, -217221, -206581, -208769, -203221, -206533, -208308, -198591, -226844, -198210, -209632, -183852, -214179, -208404, -213017, -218463, -196550, -187462, -203513, -198888, -195726, -194531, -212355, -221340, -207802, -210477, -208806, -217696, -207835, -190439, -208175, -201755, -205927, -203614, -204933, -228992, -191749, -187690, -203601, -211801, -201785, -225740, -201322, -230108, -200448, -226728, -207744, -201092, -206863, -194897, -162277, -203021, -214382, -192454, -193996, -209306, -194062, -206042, -215625, -205759, -181240]
1462a81240p963j0082m655l829j0191K5378m5892M5091K6465k1732J6186k965
1450a75429Q94k3774k2240K3714R868m798Q656J6532l7815P14J9452p8j1240j9702
1436b15246p090R076J6149j2835L5339n218q062j3768K4193k6454j2401J4376
1424b01941l581r354j2183K2580J7498k3562k460L752Q520J4277j4720O069j5706
1411b10811K6668k5197J5448P374k3365O667J0784N525k4491K6581k0549J6347
1399a89019k8043N404N915K1786k3447P496R54K4141j6743j322P67q724J2913
1386a87922j2752J6066j3502M312J9526m5749L4318K0836j7582l992M372K406
1374a79663p721j5830l2572K4458Q968k27J6042m310k9159L1161K323J4108j4372
$$ y = [-181240, -189203, -199285, -203940, -207769, -217960, -192582, -238474, -193383, -166918, -188650, -172464, -175429, -174535, -198309, -220549, -196835, -186967, -191765, -183109, -166577, -204392, -203678, -184226, -184304, -195544, -215246, -222336, -213260, -197111, -209946, -174607, -179825, -187887, -201655, -177462, -203916, -216317, -201941, -205522, -214876, -227059, -204479, -186981, -210543, -213003, -209251, -200731, -186454, -201174, -195105, -210811, -184143, -209340, -193892, -186518, -209883, -203216, -192432, -186907, -211398, -184817, -205366, -189019, -217062, -211658, -205743, -183957, -207404, -199908, -198954, -174813, -191556, -192878, -192111, -200835, -187922, -200674, -184608, -198110, -193798, -174272, -220021, -185703, -164867, -182449, -186441, -182069, -179663, -187384, -203214, -235786, -211328, -202360, -202587, -186545, -190855, -220014, -188853, -186530, -172422, -186794]
1361a86794j2169p305J7865r860J0851q703P827r61Q666R092l0836J0804l150
1348a94673l0672J8497R430p26m575O227k5157J6863J0771j9897K5228l2354K8639
1335a92399j031J3044k0547K061J0523j0929P115Q653J8749k8792J726J856k903
1322a92874r732J3758n287K039J9657L845j3495k4105j4157M8947j4056R965j7541
1309a93036k008L223J0445o444J872N907J858j5125p495L562j1134K5432r464
1296a92407j808J9757J0150k2231N425k1372p140K1849j6636K5044j738j6617
1284a97724M5465l1464L132o689l529J0846j029P30j3024J9916j388J059j8391
1271a92090M203K3996J459k8950O976j7073m800K1000j8717J2273j5869K2757
$$ y = [-186794, -198963, -206268, -188403, -198263, -187412, -196115, -188288, -189249, -180583, -171491, -202327, -191523, -194673, -225345, -206848, -197418, -198144, -202719, -196492, -221649, -204786, -194015, -213912, -188684, -221038, -192399, -193430, -180386, -200933, -198872, -188349, -199278, -192163, -183510, -164761, -193553, -191827, -189971, -192874, -202606, -188848, -194135, -192096, -172439, -168594, -182089, -206194, -220351, -171404, -185460, -175495, -193036, -195044, -191821, -181376, -187820, -185948, -180041, -178183, -193308, -200803, -197241, -208375, -182943, -192407, -194215, -174458, -164308, -186539, -181114, -202486, -209626, -187777, -204413, -179369, -181107, -197724, -152259, -183723, -180591, -187280, -190809, -179963, -180992, -180262, -193286, -173370, -174758, -173699, -192090, -187887, -163891, -162432, -191382, -184406, -201479, -206279, -185279, -203996, -191723, -207592, -184835]
1259a84835q230p978L2346j8002M048R217R692j2498J869j693n704Q355o478k3293
1245b03184L1308m263l8452M2090k4461K8984j3662j5924K6556j2605O317j0449
1233a87745j0637q502J2188j841J2029L736j5563J6618j5615o058J3424J692N770
1220a80504l560j5455r246M1272J948j3363j8070J5201L0688l8713K3611k2465
1208a88656P151j1701m065q484K1694J7075p846J4791q133k0300k5903Q693O034
1195a99650K9580j766J5604k1296J07J2765J368q481r489j0101J4256j7238o315
1182b00656P35J0011N671J0599j1839J6610j2841K72k392J7349l2662M3434m0305
1169a96014K2957j3193l27m689L7819k8838J147J5751k0228K1792k1968R377j9937
$$ y = [-184835, -193065, -201043, -168697, -186699, -182651, -173434, -163742, -176240, -174371, -176064, -181768, -173413, -179891, -203184, -171876, -176139, -214591, -172501, -196962, -167978, -181640, -197564, -171008, -183613, -177296, -187745, -198382, -206884, -194696, -196537, -184508, -180772, -196335, -179717, -195332, -201390, -187966, -186274, -180504, -184064, -199519, -208765, -167493, -165545, -178908, -196978, -181777, -151089, -189802, -166191, -188656, -181505, -193206, -197271, -205755, -184061, -166986, -174832, -160041, -168174, -188474, -214377, -205684, -199650, -170070, -171836, -156232, -177528, -177421, -164656, -163288, -171769, -181258, -191359, -177103, -194341, -200656, -199921, -189910, -184239, -173640, -185479, -168869, -181710, -181438, -183830, -166481, -199143, -155709, -196014, -173057, -186250, -186577, -191266, -153447, -182285, -181138, -165387, -185615, -163823, -185791, -176414, -196351]
1156a96351J9210J7831k294l3447J5297Q542K970l5201K6371J1812k0180K7000
1144a58440N325j8171k9582M1307j9162N41l853R996j2409n453K3571j410j3531
1131a81271M0218k9983L373j2112J403J2659k0518J1026O166j4551J1002k3483
1119a96071n325M0326m1364J5372q205J9941l0Q555j8030l225O749K1360K129
1106a57818M921O245k4703M056L9579m1395m724j0009K0392l3371K0894K6049
1094a49884k5396o184J1785R044J9855j6294k5380J4183p955j9651J191K6149
1082a68537j4661L3147k0129j0027k140j591k385J847L2219j7513Q349J5014j6017
1069a62424p527J1843N555k4670K991K959L1624j4708p347j118Q91k4560Q458
$$ y = [-196351, -177141, -159310, -161604, -195051, -179754, -171212, -168242, -203443, -177072, -165260, -185440, -158440, -153115, -171286, -200868, -159561, -178723, -178182, -182035, -172039, -184448, -189901, -166330, -167740, -181271, -141053, -171036, -167663, -179775, -178372, -165713, -186231, -175205, -169039, -183590, -172588, -196071, -201396, -161070, -202434, -187062, -195267, -175326, -175356, -166801, -184831, -188056, -181307, -159947, -157818, -152897, -146652, -171355, -167299, -127720, -169115, -173839, -183848, -163456, -196827, -175933, -149884, -175280, -181464, -169679, -160635, -140780, -157074, -182454, -168271, -176226, -195877, -194686, -168537, -183198, -150051, -170180, -180207, -182347, -183938, -186323, -184476, -152257, -169770, -161421, -146407, -162424, -169951, -158108, -152553, -177223, -174232, -171273, -139649, -154357, -161704, -162822, -161931, -186491, -178033]
1056a78033Q330J8138l5459J5734J9580k7622l1183N6804j6774n702J5749j6166
1044a76604J4479m24J6804r747N948p50j4070K903O111j4095r365L5254l5681
1031a79237K3156o453j571k7110J9086J0186k8198K3242L923j0989J9532k0274
1019a74707J1769P01j3768J3156o604N993J8181k3578k116q542K2908J6040r597
1006a50164j6850j3971Q929O726l947j0901J5363k1085J6989l2349K4667J0710
994a65883J9057k256L3168m1959j1263J2236k4981J4100o378K3606l356O853p820
981a54876k6697O968l95J9742j1975P693o125Q665J0811k0050K841k1470K8500
968a56368J4137j6313k0845J7468J2569p414k1030J1975J788j5026J0710n307
$$ y = [-178033, -169703, -151565, -187024, -171290, -151710, -179332, -210515, -153711, -170485, -176187, -160438, -176604, -162125, -162549, -145745, -155492, -149544, -150294, -164364, -161461, -155350, -169445, -178810, -143556, -179237, -156081, -162534, -164105, -191215, -172129, -161943, -190141, -166899, -162976, -173965, -154433, -174707, -162938, -162237, -176005, -162849, -169453, -163460, -145279, -168857, -170973, -179515, -156607, -140567, -150164, -167014, -180985, -172056, -165330, -169277, -180178, -164815, -185900, -168911, -201260, -176593, -165883, -146826, -149082, -115914, -157873, -169136, -156900, -181881, -167781, -174159, -150553, -153909, -147056, -154876, -181573, -174605, -175000, -155258, -167233, -159540, -165665, -157000, -146189, -166239, -163398, -184868, -156368, -142231, -158544, -179389, -161921, -149352, -156766, -177796, -165821, -164033, -179059, -168349, -173656]
956a73656J7585j4855J3974m824J5162l7919L2835J3603m854k611j931l308k1404
943a72203J3278J4968P986k5543q703K0884L735j6535L1126k0431j5731M600K891
930a59678L772j1305J573K421n645P162J9773k3764K2389p929j2200J6879p774
917a54326qJ927j5332K0143q461L842L570q670p539n694J9600n683N732m988j133
902a57020j5561K8095k6063J053K231N981j3315k610M0018J3723l3358n858M907
$$ y = [-173656, -156071, -170926, -156952, -161776, -146614, -184533, -151698, -138095, -142949, -145560, -147491, -150799, -172203, -158925, -143957, -135971, -161514, -170217, -149333, -145598, -162133, -131007, -151438, -167169, -162569, -159678, -155906, -167211, -165638, -163217, -168862, -161700, -141927, -165691, -143302, -151231, -163431, -146552, -154326, -154334, -152407, -167739, -147596, -156057, -152215, -148645, -157315, -164854, -170548, -150948, -156631, -150899, -155887, -157020, -172581, -144486, -170549, -169496, -167265, -161284, -174599, -177209, -137191, -123468, -156826, -162684, -157777]
$$ [...]
##END NTUPLES=NMR SPECTRUM
##END=
