##TITLE=abcd
##JCAMPDX= 6.0         $$ Bruker NMR JCAMP-DX V2.0
##DATA TYPE= NMR SPECTRUM
##DATA CLASS= NTUPLES
##ORIGIN= UXNMR, Bruker Analytische Messtechnik GmbH
##OWNER= root
$$ XWIN-NMR		Version 3.5
$$ Thu Nov 13 18:39:17 2025 Russian Standard Time (UT+4h)  servis@DPX200
##.OBSERVE FREQUENCY= 200.131235884673
##.OBSERVE NUCLEUS= ^1H
##.ACQUISITION MODE= SIMULTANEOUS
##.ACQUISITION SCHEME= undefined
##.AVERAGES= 32
##.DIGITISER RES= 18
##SPECTROMETER/DATA SYSTEM= spect
##.PULSE SEQUENCE= zg
##.SOLVENT NAME= CDCl3
##.SHIFT REFERENCE= (INTERNAL, CDCl3, 0, 16.4885)
##AUDIT TRAIL= $$ (NUMBER, WHEN, WHO, WHERE, WHAT)
$$ ##TITLE= Audit trail, XWIN-NMR		Version 3.5
$$ ##JCAMPDX= 5.01
$$ ##ORIGIN= Bruker BioSpin GmbH
$$ ##OWNER= servis
$$ F:\spectra/data/av/nmr/H1/1/pdata/1/auditp.txt
$$ ##AUDIT TRAIL=  $$ (NUMBER, WHEN, WHO, WHERE, WHAT)
(   1,<2025-11-13 18:38:55.31 +0400>,<servis>,<DPX200>,
      <created by zg, POWCHK disabled, PULCHK disabled
       configuration hash MD5:
       00 E9 B6 7A A2 85 ED C7 34 08 36 98 17 FE 4E 26
       data hash MD5: 32K
       B3 7B 70 61 E9 1F D3 05 0C 2C 81 0E EE 8F 18 11>)
(   2,<2025-11-13 18:38:56.85 +0400>,<servis>,<DPX200>,
      <Start of raw data processing
       efp BC_mod = 2 LB = 0.05 FT_mod = 6 PKNL = 1 PHC0 = -261.162 PHC1 = 1.301565 SI = 16K 
       data hash MD5: 16K
       C5 0F 63 A9 FC A3 6D CD D5 B9 E9 D7 E0 C1 D4 A2>)
$$ ##END=
$$ 
$$ hash MD5
$$ A4 86 52 07 71 D4 0B 3C B6 C1 50 2D 8F 3D A8 B2
##$RELAX= 
##$RELAX= 
##$RELAX= 
##$RELAX= 
##$RELAX= 
##$RELAX= 
##$RELAX= 
##$RELAX= 
$$ Bruker specific parameters
$$ --------------------------
##$DU= <F:\spectra>
##$EXPNO= 1
##$NAME= <H1>
##$PROCNO= 1
##$TYPE= <nmr>
##$USER= <av>
##$AMP= (0..31)
100 100 100 100 100 100 100 100 100 100 100 100 100 100 100 100 100 100 
100 100 100 100 100 100 100 100 100 100 100 100 100 100 
##$AQSEQ= 0
##$AQ_mod= 1
##$AUNM= <au_zg>
##$AUTOPOS= <>
##$BF1= 200.13
##$BF2= 200.13
##$BF3= 200.13
##$BF4= 200.13
##$BF5= 500.13
##$BF6= 500.13
##$BF7= 500.13
##$BF8= 500.13
##$BYTORDA= 1
##$CFDGTYP= 0
##$CFRGTYP= 5
##$CHEMSTR= <none>
##$CNST= (0..31)
1 1 145 1 1 1 1 1 1 1 1 1 1 1 1 1 1 1 1 1 1 1 1 1 1 1 1 1 1 1 1 1 
##$CPDPRG= <>
##$CPDPRG1= <>
##$CPDPRG2= <>
##$CPDPRG3= <>
##$CPDPRG4= <mlev>
##$CPDPRG5= <mlev>
##$CPDPRG6= <mlev>
##$CPDPRG7= <mlev>
##$CPDPRG8= <mlev>
##$CPDPRGB= <>
##$CPDPRGT= <>
##$D= (0..31)
0 2 0 0 0 0 0 0 0 0.06 0 0 0 0 0 0 0.0002 0 0 0 0 0 0 0 0 0 0 0 0 0 0 
0 
##$DATE= 1763044734
##$DBL= (0..7)
120 120 120 120 120 120 120 120 
##$DBP= (0..7)
150 150 150 150 150 150 150 150 
##$DBP07= 0
##$DBPNAM0= <>
##$DBPNAM1= <>
##$DBPNAM2= <>
##$DBPNAM3= <>
##$DBPNAM4= <>
##$DBPNAM5= <>
##$DBPNAM6= <>
##$DBPNAM7= <>
##$DBPOAL= (0..7)
0.5 0.5 0.5 0.5 0.5 0.5 0.5 0.5 
##$DBPOFFS= (0..7)
0 0 0 0 0 0 0 0 
##$DE= 6
##$DECBNUC= <off>
##$DECIM= 32
##$DECNUC= <off>
##$DECSTAT= 4
##$DIGMOD= 1
##$DIGTYP= 9
##$DL= (0..7)
0 120 120 120 120 120 120 120 
##$DP= (0..7)
150 150 150 150 150 150 150 150 
##$DP07= 0
##$DPNAME0= <>
$$ [...]
##$SUBNAM4= <"">
##$SUBNAM5= <"">
##$SUBNAM6= <"">
##$SUBNAM7= <"">
##$SUBNAM8= <"">
##$SUBNAM9= <"">
##$SW= 20.6817932712277
##$SWIBOX= (0..15)
0 0 3 0 0 0 0 0 0 0 0 0 0 0 0 0 
##$SW_h= 4139.07284768212
##$TD= 32768
##$TD0= 1
##$TE= 0
##$TE2= 300
##$TE3= 300
##$TEG= 300
##$TL= (0..7)
0 120 120 120 120 120 120 120 
##$TP= (0..7)
150 150 150 150 150 150 150 150 
##$TP07= 0
##$TPNAME0= <>
##$TPNAME1= <>
##$TPNAME2= <>
##$TPNAME3= <>
##$TPNAME4= <>
##$TPNAME5= <>
##$TPNAME6= <>
##$TPNAME7= <>
##$TPOAL= (0..7)
0.5 0.5 0.5 0.5 0.5 0.5 0.5 0.5 
##$TPOFFS= (0..7)
0 0 0 0 0 0 0 0 
##$TUNHIN= 0
##$TUNHOUT= 0
##$TUNXOUT= 0
##$USERA1= <user>
##$USERA2= <user>
##$USERA3= <user>
##$USERA4= <user>
##$USERA5= <user>
##$V9= 5
##$VALIST= <valist>
##$VCLIST= <CCCCCCCCCCCCCCC>
##$VD= 0
##$VDLIST= <DDDDDDDDDDDDDDD>
##$VPLIST= <PPPPPPPPPPPPPPP>
##$VTLIST= <TTTTTTTTTTTTTTT>
##$WBST= 1024
##$WBSW= 30
##$XGAIN= (0..3)
0 0 0 0 
##$XL= 0
##$YL= 0
##$YMAX_a= 291927
##$YMIN_a= -168822
##$ZGOPTNS= <>
##$ZL1= 120
##$ZL2= 120
##$ZL3= 120
##$ZL4= 120
##$ABSF1= 0
##$ABSF2= 0
##$ABSG= 0
##$ABSL= 0
##$ALPHA= 0
##$AQORDER= 0
##$ASSFAC= 0
##$ASSFACI= 0
##$ASSFACX= 0
##$ASSWID= 0
##$AUNMP= <proc_1d>
##$AZFE= 0.1
##$AZFW= 0.1
##$BCFW= 0
##$BC_mod= 2
##$BYTORDP= 0
##$COROFFS= 0
##$CY= 18.4799938201904
##$DATMOD= 1
##$DC= 0
##$DFILT= <>
##$DTYPP= 0
##$F1P= 9.9274215381318
##$F2P= -0.165520771350173
##$FCOR= 1
##$FTSIZE= 16384
##$FT_mod= 6
##$GAMMA= 0
##$GB= 0
##$INTBC= 1
##$INTSCL= 4.127829e-11
##$ISEN= 128
##$LB= 0.05
##$LEV0= 0
##$LPBIN= 0
##$MAXI= 10000
##$MC2= 0
##$MEAN= 0
##$ME_mod= 0
##$MI= 50
##$NCOEF= 0
##$NC_proc= -8
##$NLEV= 6
##$NOISF1= 3.799351
##$NOISF2= 2.8
##$NSP= 0
##$NTH_PI= 0
##$NZP= 0
##$OFFSET= 16.48848
##$PC= 4
##$PHC0= -261.162
##$PHC1= 1.301565
##$PH_mod= 1
##$PKNL= yes
##$PPARMOD= 0
##$PSCAL= 4
##$PSIGN= 0
##$REVERSE= no
##$SF= 200.130005582386
##$SI= 16384
##$SIGF1= 3
##$SIGF2= 2
##$SINO= 400
##$SIOLD= 16384
##$SREGLST= <1H.CDCl3>
##$SSB= 0
##$STSI= 16384
##$STSR= 0
##$SW_p= 4139.07284768211
##$SYMM= 0
##$S_DEV= 0
##$TDeff= 32768
##$TDoff= 0
##$TI= <>
##$TILT= no
##$TM1= 0
##$TM2= 0
##$TOPLEV= 0
##$USERP1= <user>
##$USERP2= <user>
##$USERP3= <user>
##$USERP4= <user>
##$USERP5= <user>
##$WDW= 1
##$XDIM= 16384
##$YMAX_p= 440062250
##$YMIN_p= -2559278
$$ End of Bruker specific parameters
$$ ---------------------------------
##NTUPLES= NMR SPECTRUM
##VAR_NAME=  FREQUENCY,     SPECTRUM/REAL,   SPECTRUM/IMAG
##SYMBOL=    X,             R,               I
##VAR_TYPE=  INDEPENDENT,   DEPENDENT,       DEPENDENT
##VAR_FORM=  AFFN,          ASDF,            ASDF
##VAR_DIM=   16384,         16384,           16384
##UNITS=     HZ,            ARBITRARY UNITS, ARBITRARY UNITS
##FACTOR=    0.252644378177508, 1,           1
##FIRST=     3299.83951724647, 0,            0
##LAST=      -839.233330435636, 0,           0
##MIN=       -839.233330435636, -2559278,    0
##MAX=       3299.83951724647, 440062250,    0
$$ Real data points
##PAGE= N=1
##DATA TABLE= (X++(R..R)), XYDATA
$$ [...]
8794F62441L97952q69347L54000J06133l37361j68681J252466r09422O7645M59645
$$ 662441 1060393 191046 545046 651179 313818 145137 1397603 488181 555826 1015471
8784A015471r1930k53564r16749Q58279l57694P8071O61498N5844j93792P10865
$$ 1015471 923541 669977 -246772 611507 253813 331884 993382 1049226 855434 1566299
8774A566299m62131l8897l73757m35823k16341L92974L33187r20061L25194Q60534
$$ 1566299 1104168 1065271 691514 255691 39350 432324 765511 -154550 170644 1031178
8764A031178o92348J31197k12984j0515P48059j85517p27744L82761K35659k83981
$$ 1031178 338830 470027 257043 246528 994587 809070 81326 464087 699746 415765
8754D15765K73831k03223k38072J76404p89l2973P86804n17836o65627M66363
$$ 415765 689596 486373 248301 424705 423916 390943 1177747 659911 -5716 460647
8744D60647j035048o688P69739P34410l65219O9372m78009k32678P12912k61714
$$ 460647 -574401 -581089 188650 923060 557841 627213 149204 -83474 629438 367724
8734C67724j43390k50214L893K12947J8936L4481o855n8542k16468P07134l43825
$$ 367724 224334 -25880 -21987 190960 209896 244377 237522 178980 -37488 669646 325821
8723C25821m18422K5218O65845L94439l0578K2336o04663j27336n9862j83671
$$ 325821 -92601 -67383 598462 992901 962323 984659 379996 252660 192798 9127
8713I127N70262K83119j098676P90664k7028l40834l24003Q22826q56456R5998
$$ 9127 579389 862508 -236168 554496 527468 186634 -137369 685457 -170999 -75001
8703g5001l49317J560263p20439r2090p63376O15711J17503M73129j13251q115
$$ -75001 -424318 1135945 415506 323416 -439960 175751 293254 766383 653132 645017
8693F45017m23093N83360n58855K12470r5168m61612O30343L6649K04944N4432
$$ 645017 221924 805284 246429 458899 363731 -97881 532462 569111 774055 828487
8683H28487o85301N52141p90540N90675q08276Q13677P0636N33070O0468q47420
$$ 828487 143186 695327 -95213 495462 -312814 500863 571499 1104569 1165037 317617
8673C17617N43057m8354l0259J62680R4358L0145o94096O558M34041j3936p2701
$$ 317617 860674 812320 782061 944741 1039099 1069244 375148 381706 815747 801811 729110
8662G29110p7626L90618J23269j322037Q62920J61326l95909M41280j269699K93190
$$ 729110 651484 1042102 1165371 -156666 706254 867580 471671 912951 -356748 -63558
8652f3558J60848M69475j00244k4827m2271J92541o89939J048671q44319K84989
$$ -63558 97290 566765 466521 441694 399423 591964 -97975 950696 106377 391366
8642C91366K4080J69591m65492m51462J293819n42081p30494M78234n4882R5393
$$ 391366 415446 585037 119545 -331917 961902 419821 -310673 167561 112679 208072
8632B08072l1111K90869r39932Q26574l13772N4422j42794L43478m18383K97773
$$ 208072 176961 467830 -472102 354472 40700 95122 -47672 295806 -122577 175196
8622A75196K32783M56281m87455k22706K10405K79236P4434p57834K87796j84110
$$ 175196 407979 864260 376805 154099 364504 643740 718174 -39660 248136 64026
8612F4026m86920J051281k71056M7835l09941J71872N73148j337805J175620l59166
$$ 64026 -422894 628387 357331 405166 95225 267097 840245 -497560 678060 318894
8602C18894P81184j300977J52629P61300o0048R0622K30148j355077J948948j494177
$$ 318894 1100078 -200899 -48270 713030 652982 743604 973752 -381325 1567623 73446
8592G3446l04173J458802j460165Q90580j03721m22126L87550P5153m00763L70790
$$ 73446 -230727 1228075 -232090 658490 554769 132643 520193 595346 194583 565373
8582E65373n73188K24859l25081N49838m3453K54814k36901j90568M10025n62729
$$ 565373 -7815 217044 -108037 441801 398348 653162 416261 225693 635718 72989
8572G2989J27660N42831o91196n5922j84266Q60176m30530M32785o81046L78676
$$ 72989 200649 743480 52284 -3638 -187904 672272 241742 674527 -6519 372157
8562C72157q56604J010099n88799l31481n7814Q29853J6736O88260j225684N75668
$$ 372157 -484447 525652 -63147 -394628 -452442 377411 394147 1082407 -143277 432391
8552D32391J55262l36390O9736l28783q473P1078J055881j218073J162127k20921
$$ 432391 587653 251263 320999 -7784 -16257 54821 1110702 -107371 1054756 833835
8542H33835m31150J34954M92702o94454O47392r68072p7077L65819p20268n1922
$$ 833835 402685 537639 1030341 335887 983279 15207 -61870 303949 -416319 -468241
8532d68241K011412n86374L18475o61407J87054l56842j07793l71929J53637M20016
$$ -468241 1543171 956797 1275272 613865 800919 444077 336284 -35645 117992 538008
8522E38008P28801p31839M74104k23684p06914k21477L01462K1723J60464m82274
$$ 538008 1266809 534970 1009074 785390 78476 -143001 158461 180184 340648 -141626
8512a41626R5033m0133n5969j78369R24793l7343l07856N65903r89506k3586O16566
$$ -141626 -46593 -86726 -142695 -321064 603729 566386 258530 824433 -165073 -188659 427907
8501D27907j43001m3407P4899N12676k31054r03606J455983j014589J04119N77748
$$ 427907 284906 241499 316398 829074 598020 -305586 1150397 135808 239927 817675
8491H17675l18054N34616o48843j19314M94462m27488M20319k37868l24467r6737
$$ 817675 499621 1034237 385394 266080 760542 333054 753373 515505 191038 94301
8481I4301p3630M09306L7902k45690j52883J26051J44866l35147R41469q26614
$$ 94301 20671 429977 467879 222189 69306 195357 340223 5076 946545 119931
8471A19931O20906k97502n23612O10928n07080K83759J67669m62656Q51506n93120
$$ 119931 740837 443335 -80277 530651 23571 307330 474999 12343 863849 270729
8461B70729L39867j65754L25054l26326k90952K83321N62072l62227k9448l83779
$$ 270729 610596 444842 769896 443570 152618 435939 998011 635784 606336 222557
8451B22557N59973o60017M70375k06173O92011o59765k77671M17868O9827L24809
$$ 222557 782530 122513 592888 386715 1078726 418961 141290 559158 628985 953794
8441I53794n09398J61323m4868M30945j57866p60025J04135L05547Q93674p41642
$$ 953794 444396 605719 560851 991796 833930 73905 178040 483587 1377261 635619
8431F35619J18270j76590M86288m67393k06771N82674p80298P80664L479m34137
$$ 635619 753889 577299 1063587 596194 389423 972097 191799 972463 975942 541805
8421E41805N28087O04352o35285n24702r4797O66245n40750N37149q67146K90935
$$ 541805 1069892 1674244 1038959 514257 419460 1085705 544955 1082104 214958 505893
8411E05893K97932o69707J82017N87071l70273K92574J22207j57840l50996m32941
$$ 505893 803825 134118 316135 903206 532933 825507 947714 789874 438878 5937
8401E937P11166l19476R29653o50789K09187o95199K93447n49030P11651l37664
$$ 5937 717103 397627 1327280 676491 885678 190479 483926 -65104 646547 308883
8391C08883J142646l50455N3606m6320M13007o88880R81716r39121K8081N296
$$ 308883 1451529 1101074 1154680 1108360 1521367 832487 1814203 875082 903163 908459
8381I08459O125M27852m54545Q59226p43286Q11094n84973K24357l63334J105747
$$ 908459 914584 1342436 887891 1747117 1003831 1814925 1229952 1454309 1090975 2196722
8371B196722m96132j104694O29704p0625L78505l41774o7321Q43560L29999q39543
$$ 2196722 1700590 595896 1225600 1154975 1533480 1191706 1124385 1967945 2297944 1458401
8361A458401K4898J48936o62894P43758k20967J29996P30447n69202m72097J090304
$$ 1458401 1483299 1632235 969341 1713099 1492132 1622128 2352575 1783373 1311276 2401580
8351B401580j132325J03387R45645o17799r732O51534p01591n0098J091887o53179
$$ 2401580 1269255 1372642 2318287 1700488 1690756 2342290 1640699 1590601 2682488 2029309
8341B029309l10454l57981R36941o7630j34468j07836P55006o68352K33978N22481
$$ 2029309 1718855 1360874 2297815 2230185 2095717 1987881 2742887 2074535 2308513 2830994
8331B830994m09778k87899M25443q44593O54009m75370J215003o05312k40178
$$ 2830994 2421216 2133317 2558760 1714167 2368176 1892806 3107809 2502497 2262319
8322B262319M75143J81052j9929k50837K45087q4313M51553J33946j18498J74267
$$ 2262319 2737462 2918514 2898585 2647748 2892835 2808522 3260075 3394021 3275523 3449790
8312C449790M32858o9815K17238l11636P66989K78796o28764J77879j322300J656324
$$ 3449790 3882648 3812833 4030071 3718435 4485424 4764220 4135456 4313335 2991035 4647359
8302D647359m08841r91103O79288J31419q11439M39649P64348k50282l12742O39647
$$ 4647359 4238518 3247415 3926703 4058122 3246683 3686332 4450680 4200398 3887656 4527303
8292D527303k87091n48830L08366o41531O56646K08382m52407n37870M67665m5573
$$ 4527303 4240212 3691382 3999748 3358217 4014863 4223245 3770838 3232968 3700633 3655060
8282C655060k03686R405L1090n30673J008927l02292l71559J7390O4175k57435
$$ 3655060 3451374 3460779 3491869 2961196 3970123 3667831 3296272 3313662 3377837 3120402
8272C120402J33276l74343N18198j14824l40548M59562p86495J76002k6529r34119
$$ 3120402 3253678 2879335 3397533 3282709 2942161 3401723 2615228 2791230 2764701 1830582
8262A830582N49888M37371j87826m14295J3027j93191L81990o59987M53309j39609
$$ 1830582 2380470 2817841 2630015 2215720 2228747 2035556 2417546 1757559 2210868 2071259
8252B071259l56170j69923M14097o13623N27301J66408L70075o80651L78809r539
$$ 2071259 1715089 1545166 1959263 1345640 1872941 2039349 2409424 1728773 2107582 2098043
8242B098043j06617p33009M51730k05779P2920l44962j30225O56690o95193L88231
$$ 2098043 1991426 1258417 1710147 1504368 1577288 1232326 1102101 1758791 1063598 1451829
8232A451829j62722J242484r72011K27106j13512n97684o5379Q01217r16387k3551
$$ 1451829 1289107 2531591 1559580 1786686 1673174 1075490 1010111 1811328 894941 871390
8222H71390L49060l98905N83476j40504n17440j15458J05850j89047Q4245O85362
$$ 871390 1220450 821545 1405021 1264517 747077 631619 737469 548422 632667 1318029
8212A318029J89685J63505j26624L10399j142115N7607l46798J92555K6020Q06473
$$ 1318029 1507714 1671219 1544595 1854994 712879 770486 423688 616243 642263 1448736
8202A448736p68696K87779n73934J283778r20044L5252J02614o42137N69185n22849
$$ 1448736 680040 967819 393885 1677663 757619 792871 895485 253348 822533 299684
8192B99684j885018M966219k023025K73038q79504k00939R36295n9779N9783j99330
$$ 299684 -1585334 3380885 1357860 1630898 751394 550455 1486750 1426971 1486754 1287424
8182A287424N27818q87134l60491Q41493M32346j871251R46491P60466j755377
$$ 1287424 1815242 928108 567617 1409110 1841456 -29795 916696 1677162 -78215
8173g8215Q12460O56384k7952o34065k15553P85355l34022j1430k87821N21361
$$ -78215 734245 1390629 1362677 728612 513059 1298414 964392 952962 665141 1186502
8163A186502r39867J06119P04854N64438J05175r23860l85103N28600j18755r0719
$$ 1186502 246635 352754 1057608 1622046 1727221 803361 418258 946858 828103 737384
8153G37384O74539k19738j025020J723681j001992R3112L53204n83683r91478
$$ 737384 1411923 1192185 167165 1890846 888854 981966 1335170 751487 -239991
8144b39991J183029l38678J59264P01565q46106l56840R1292O26192N66248q22624
$$ -239991 943038 604360 763624 1465189 619083 262243 353535 979727 1545975 723351
8134G23351L27172k11929J97881l57787O039P005p39j6600L76533k15266N21303
$$ 723351 1050523 838594 1036475 678688 684727 691732 690993 674393 1050926 835660 1356963
8123A356963m01838j29548O25892q37266J066053o19587j08658m84852O02482
$$ 1356963 955125 825577 1451469 614203 1680256 1060669 952011 467159 1069641
8114A069641m61168l12931J73872l10412L61646N89831n86971K72734N05533n11494
$$ 1069641 608473 295542 469414 159002 520648 1110479 523508 796242 1301775 790281
8104G90281k26032m0086P62993m57505M24554m02563j138059J502208o15224m49465
$$ 790281 564249 524163 1287156 829651 1254205 851642 -286417 1215791 600567 151102
8094A51102K90518p9696j04434k43312P15236K4126k33591p0998k92546Q56759
$$ 151102 441620 361924 257490 14178 729414 753540 519949 448951 156405 1013164
8084A013164P9378p13631M70920n9135J25327m58485J25148j61327M53763l02218
$$ 1013164 1092542 378911 849831 790696 916023 457538 582686 421359 875122 572904
8074E72904m26600M69742O41921K81651n06224k96668n05384K32258M29086N92937
$$ 572904 146304 616046 1257967 1539618 1033394 736726 231342 463600 892686 1485623
8064A485623j332687O26761m81586M2135P13416k94488l18030N1340N99530M8630
$$ 1485623 152936 779697 298111 340246 1053662 759174 441144 492484 1092014 1140644
8054A140644j81568O66717j055252k93457K87383m14415J256145n82804j84142
$$ 1140644 959076 1625793 570541 277084 564467 150052 1406197 823393 639251
8045F39251l00234J41050J50361J99339l58906L05639M94151p82234M51466p55561
$$ 639251 339017 480067 630428 829767 470861 776500 1270651 488417 939883 184322
8035A84322R98170m10306J11439l72969P93730l61789M57445p78368L87436o2591
$$ 184322 1182492 772186 883625 510656 1304386 942597 1400042 621674 1009110 946519
8025I46519m18608N52403o38949K68653k98055O13994r79074R85250p45654N63684
$$ 946519 527911 1080314 441365 710018 411963 1025957 46883 1032133 286479 850163
8015H50163k14290N60386q11434K7904M85983o50253R70291j063018J142163r07805
$$ 850163 635873 1196259 384825 412729 898712 248459 1218750 155732 1297895 390090
8005C90090P33765q66673K17400K05625O41169k56748J77675o91913K24404q853
$$ 390090 1123855 257182 474582 680207 1321376 1064628 1242303 550390 774794 765941
7995G65941q9987n9447K90994o90948L36646l46619N91454K21528j58735M32114
$$ 765941 675954 616507 907501 216553 553199 206580 798034 1019562 860827 1292941
7985A292941q00526q9484O66440L33005o29927K56541l85101L77638l38780J71400
$$ 1292941 492415 402931 1069371 1402376 772449 1028990 643889 1021527 682747 854147
7975H54147j53917J58220l12175N36020j87132j18441M03205n29203M12040J12292
$$ 854147 700230 858450 546275 1082295 895163 776722 1179927 650724 1062764 1175056
7965A175056k85360r4209j69803l38006N59386p21403R48764P8060n64989P084
$$ 1175056 889696 795487 625684 287678 847064 125661 1074425 1152485 587496 594580
7955E94580J096230n18682m49785J2077P2522J40520j171024J115543l91727J133641
$$ 594580 1690810 1172128 722343 734420 806942 947462 -223562 891981 500254 1633895
7945A633895r18763o78447O77735N88511j056563Q86060P1108m28061k17470J135908
$$ 1633895 715132 36685 714420 1302931 246368 1132428 1203536 775475 558005 1693913
7935A693913k02561p33912m93976j78916M85231L09042k37338J007244r20139
$$ 1693913 1491352 757440 263464 84548 569779 878821 641483 1648727 728588
7926G28588l4412q1909J66471k85956m76250R32312l13136j65951M337L63792
$$ 728588 694176 612267 778738 492782 16532 948844 635708 469757 474094 837886
7916H37886m65833K43400N404j58633M80186m34197M88464l55073L45263J44183
$$ 837886 372053 615453 620857 462224 942410 508213 996677 641604 986867 1131050
7906A131050k71375j09486M97729l6827K24801k63867k94659K59067m37675K82759
$$ 1131050 859675 750189 1247918 1211091 1435892 1172025 877366 1136433 698758 981517
7896I81517k23983L21407l76340K31905l81935Q00081M03431o21364P03752o76266
$$ 981517 757534 1078941 702601 934506 552571 1352652 1756083 1134719 1838471 1162205
7886A162205j72832J51995j45522L00619o2599l98679n60193O74139K30931o40273
$$ 1162205 989373 1141368 995846 1296465 1233866 835187 274994 949133 1180064 539791
7876E39791J55630j30861L21819P5578j3913j00788p6354j25485N15208n57886
$$ 539791 695421 564560 886379 961957 948044 847256 770902 645417 1160625 602739
7866F02739N15464M40248j370405P93462M38794r25220N40538O80494r09035p7387
$$ 602739 1118203 1558451 188046 981508 1420302 495082 1035620 1716114 807079 729692
7856G29692M30808p55024N22895P21516J754853p2301l516507Q14751l73082k19889
$$ 729692 1160500 405476 928371 1649887 3404740 3332439 -184068 630683 257601 37712
7846C7712N89154K037767k455648K06333k56731O56866J34609l06388K2657J28532
$$ 37712 626866 2664633 208985 415318 158587 815453 950062 643674 666331 794863
7836G94863J15449K08014j036757J054737q30900o6206R92396k35098k42456J29534
$$ 794863 910312 1118326 81569 1136306 305406 239200 1231596 996498 754042 883576
7826H83576m39737J91143N64808Q7486o12284N54946k46471o32983R14679l17400
$$ 883576 443839 634982 1199790 1287276 674992 1229938 983467 350484 1265163 947763
7816I47763n34918o93510P05740M01124l30505O45031m80791m91081M94069O7100
$$ 947763 412845 -280665 425075 826199 495694 1140725 659934 168853 662922 730022
7806G30022m60480J385678l04877o45387J95320n44174J48717M84964m09561K87392
$$ 730022 269542 1655220 1350343 704956 900276 356102 504819 989783 580222 867614
7796H67614J1713k8484K11887K58289p98212J60446L47496J85724r85009J043639
$$ 867614 879327 850843 1062730 1321019 522807 683253 1030749 1216473 231464 1275103
7786A275103j090506O01995j15510Q38675p82150o6101R1418R7446n77111Q02069
$$ 1275103 184597 786592 671082 1509757 727607 661506 752924 850370 273259 1075328
7776A075328m53286M09986l36967l6797m91568Q91984p28089J046207J05938m27193
$$ 1075328 622042 1032028 695061 658264 166696 1058680 330591 1376798 1482736 1055543
7766A055543r47986J201283J96640k49075J42095l90172m15253j54269Q9832N57600
$$ 1055543 107557 1308840 1505480 1256405 1398500 1008328 593075 438806 528638 1086238
7756A086238k35468J090383j341676N49R2121L49112J20249j458952Q52193M05753
$$ 1086238 850770 1941153 599477 600026 692147 1041259 1161508 -297444 554749 960502
7746I60502l3302m07339O58577n05802P43768m1015o13975L24137k02467p5048
$$ 960502 927200 519861 1178438 672636 1416404 1375389 761414 1085551 883084 808036
7736H08036J7427l37183Q20963k99527L76768n98228O17299N735l52509J91700
$$ 808036 825463 488280 1309243 1009716 1386484 788256 1405555 1411290 1058781 1250481
7726A250481p65254J214264n05438j64318l35149K96363l13182k8396R644l64135
$$ 1250481 485227 1699491 1194053 1029735 694586 990949 677767 649371 659015 294880
7716B94880O79819L53662k8075n09358K52127m52845N65942m36143M32690K85415
$$ 294880 974699 1328361 1300286 790928 1043055 590210 1156152 720009 1152699 1438114
7706A438114m76631L51570m35986k56134L67691k3680o50939N26321M95910L04037
$$ 1438114 961483 1313053 877067 620933 988624 964944 314005 840326 1336236 1640273
7696A640273r35440Q14703k76002j97912K55288o98938N86081l65034R1506N55832
$$ 1640273 704833 1519536 1243534 1045622 1300910 601972 1188053 823019 914525 1470357
7686A470357n84964R00935n24455o08165J37038O47843q29164L78635L0515O4544
$$ 1470357 885393 1786328 1261873 653708 790746 1438589 609425 988060 1018575 1083119
7676A083119l36786L22151N14336k90604L83621q18215k72023M62351l64387J052788
$$ 1083119 746333 1068484 1582820 1292216 1675837 857622 585599 1047950 683563 1736351
7666A736351n49975l33300O01438K20569q26683M01782l93897L78111n41578n1726
$$ 1736351 1186376 853076 1454514 1675083 848400 1250182 856285 1234396 692818 641092
7656F41092N86925l20659n42370J131637n60263O36459o19236K59377o30506j7969
$$ 641092 1228017 907358 364988 1496625 936362 1572821 953585 1212962 582456 564487
7646E64487J249447l73549r65722M26840N30633o75982L54985j28242k40859R88397
$$ 564487 1813934 1440385 474663 901503 1432136 756154 1111139 982897 742038 1730435
7636A730435J33927j111642l00624N12870p3243Q84217j749796M05391N40687
$$ 1730435 1864362 752720 452096 964966 891723 1775940 26144 431535 972222
7627I72222K91822m69648K21117q3063L04363j64032n24845J035771q2211J20013
$$ 972222 1264044 794396 1015513 932450 1236813 1072781 547936 1583707 1501496 1621509
7617A621509m99221m21864R79996p88837K99927o00119Q17763j32167k09063N3092
$$ 1621509 1122288 700424 1680420 891583 1191510 591391 1409154 1276987 1067924 1121016
7607A121016N323l74263R49133j065643l80109J86385P98150l32082j124091K687046
$$ 1121016 1126339 752076 1701209 635566 255457 441842 1239992 907910 -216181 2470865
7597B470865q83860L58570q45055K15636K48063k71538P6840n1243J68404p8375
$$ 2470865 1587005 1945575 1100520 1316156 1564219 1292681 1369521 1318278 1486682 1408307
7587A408307L25958m71482K21929J20469k44981L8905Q68397r33749j90455Q76820
$$ 1408307 1734265 1262783 1484712 1605181 1360200 1399105 2267502 1333753 1143298 2020118
7577B020118q87352M44678L17101L2526O29634q88202Q5839j3030p65785Q16040
$$ 2020118 1132766 1577444 1894545 1927071 2556705 1668503 1754342 1741312 975527 1791567
7567A791567R6862M20896m80428l44151J82868j47022O08387l58358k26237J36277
$$ 1791567 1888429 2309325 1828897 1484746 1667614 1520592 2128979 1770621 1544384 1680661
7557A680661l7656k60131R67148m74692J44436N14807n45382j56909o12973O92447
$$ 1680661 1643005 1382874 2350022 1875330 2019766 2534573 1989191 1832282 1219309 1911756
7547A911756n67027P9701L94827j59543M80629n06592R5037l46236O28643m88651
$$ 1911756 1344729 1424430 1819257 1659714 2140343 1633751 1728788 1382552 2011195 1522544
7537A522544M64953p42198l01247L55896P69456n60797n65907M92378M88977m821
$$ 1522544 1987497 1245299 944052 1299948 2069404 1508607 942700 1435078 1924055 1919234
7527A919234l31379r5003M6725j42689Q0147l22783O5478j92450L09965N91270
$$ 1919234 1587855 1492852 1539577 1396888 1477035 1154252 1219730 1027280 1337245 1928515
7517A928515k47772l1904j40133K61176j1897K03125q18532N63444J71611j41061
$$ 1928515 1680743 1648839 1508706 1769882 1757985 1961110 1142578 1706022 1877633 1736572
7507A736572l25588M94669q71730R26995j48327j67838L10187o1278o60482N08798
$$ 1736572 1410984 1905653 1033923 1960918 1812591 1644753 1954940 1893662 1233180 1741978
7497A741978K37026k63478m09645L49635J65106l95889O1860P11583j12708r9273
$$ 1741978 1979004 1715526 1305881 1655516 1820622 1424733 1486593 2198176 2085468 1986195
7487A986195J60047n02886j45405L64992N69439r76600N33630m41238j58049J051243
$$ 1986195 2146242 1643356 1497951 1862943 2432382 1455782 1989412 1548174 1390125 2441368
7477B441368o69715N10392l66245m11034O15682m49012R9051j10068J73965L72993
$$ 2441368 1771653 2282045 1915800 1504766 2120448 1671436 1770487 1660419 1834384 2207377
7467B207377j92880k32616n44866J005460q65281l0308N23215k62478N28557m68473
$$ 2207377 2014497 1781881 1237015 2242475 1377194 1346886 1870101 1607623 2136180 1667707
7457A667707m22091O19279L99646N2465o63721o48320L25827K68364J16877j87863
$$ 1667707 1245616 1864895 2264541 2317006 1653285 1004965 1330792 1599156 1716033 1528170
7447A528170J02080L07404n94201J007275r59418J84800L83428J29055j204017
$$ 1528170 1630250 1937654 1343453 2350728 1391310 1576110 1959538 2088593 884576
7438H84576R03762J67376P21467o96116j58831N4682p39007N94203P80686k74561
$$ 884576 1788338 1955714 2677181 1981065 1822234 1876916 1137909 1732112 2512798 2238237
7428B238237K38581k48626j35470k64606M45362j09433L52804L70950q98574J316355
$$ 2238237 2476818 2228192 2092722 1828116 2273478 2164045 2516849 2887799 1989225 3305580
7418C305580j149274n01131L66324M11372k4556K72517p54115J98604K59174l83550
$$ 3305580 2156306 1655175 2021499 2432871 2408315 2680832 1926717 2125321 2384495 2000945
7408B000945j59487l49930L32381K48641J33359j43591L34996Q4732n63955p41847
$$ 2000945 1841458 1491528 1823909 2072550 2205909 2062318 2397314 2482046 1918091 1176244
7398A176244N94556N27236m27281J33535O95259q67777L67838r77902O61301m61534
$$ 1176244 1770800 2298036 1870755 2004290 2699549 1831772 2199610 1221708 1883009 1421475
7388A421475K94690P68403p07166j31931M27655q37012R02080M41011N3939o49372
$$ 1421475 1716165 2484568 1777402 1645471 2073126 1236114 2138194 2579205 2633144 1983772
7378A983772L15552k76765O6949J91206K3267j91072k76814M68205L72278j058254
$$ 1983772 2299324 2022559 2089508 2280714 2303981 2112909 1836095 2304300 2676578 1618324
7368A618324L70241j21727J26175N75639q10884M97278l82140Q49021l61931k27357
$$ 1618324 1988565 1866838 1993013 2568652 1757768 2255046 1872906 2721927 2359996 2132639
7358B132639m72343R87465k69543K33457j80029L13380n29951J033586n99304
$$ 2132639 1660296 2647761 2378218 2611675 2431646 2745026 2215075 3248661 2649357
7349B649357k99980j36942K60548m43871K58604N24968j3910o61774O29238m29129
$$ 2649357 2349377 2212435 2472983 2029112 2287716 2812684 2798774 2137000 2766238 2337109
7339B337109N82606m57347m4717l50041Q63430J4329n30373n9742N74875n74295
$$ 2337109 2919715 2462368 2417651 2067610 2931040 2945369 2414996 2355254 2930129 2355834
7329B355834J69721O31941l55576k93849l41634L20980j4574m73118q5961O60395
$$ 2355834 2525555 3157496 2801920 2508071 2166437 2487417 2472843 1999725 1913764 2574159
7319B574159j52154O89157m86408l34739L2265l70232M0747P85352N8919L50255
$$ 2574159 2422005 3111162 2624754 2290015 2322280 1952048 1992795 2778147 2837066 3187321
7309C187321Q6360j94069O57066l89039n31951J69689k74124M30846M00693p89781
$$ 3187321 3273681 3079612 3736678 3347639 2815688 2985377 2711253 3142099 3542792 2753011
7299B753011r8643J371178k391j319924K27538J048145j438841L0368O37021m30634
$$ 2753011 2654368 4025546 4023155 2703231 2930769 3978914 2540073 2570441 3207462 2776828
7289B776828O30424q46015R33051o10800J219639p23544R38078j628023J574400
$$ 2776828 3407252 2561237 3494288 2883488 4103127 3379583 4317661 2689638 4264038
7280D264038r49694n6557k85879Q71303n7852j173802N11695l59076R04893L0735
$$ 4264038 3314344 3257787 2971908 3843211 3785359 2611557 3123252 2764176 3669069 3699804
7270C699804p4044N9974k8504m308l47846Q0605L51120J90725k08140p00352N46994
$$ 3699804 3625760 3685734 3657230 3652922 3305076 3385681 3736801 3927526 3719386 3019034 3566028
7259C566028L82261j51224l76165N56990j073109J254859j92565j29618M878l9418
$$ 3566028 3948289 3797065 3420900 3977890 2904781 4159640 3967075 3837457 3842335 3802917
7249C802917L583O1651K85549K79280o07303p9098P06466k53638j81480O24425
$$ 3802917 3806500 3868151 4153700 4432980 3825677 3746579 4453045 4199407 4017927 4642352
7239D642352n04364l74233j58020L79156J54426L958l09473J3816o1387l48299
$$ 4642352 4137988 3763755 3605735 3984891 4139317 4143275 3833802 3847618 3786231 3437932
7229C437932N57310L01247j09633p94139K60680M35373l13150J90322j78488j25412
$$ 3437932 3995242 4296489 4186856 3392717 3653397 4088770 3775620 3965942 3787454 3662042
7219C662042M20524n18879M52793K07899r0990m74412j04960K0892j9665M22158
$$ 3662042 4082566 3563687 4016480 4224379 4133389 3658977 3554017 3574909 3555244 3977402
7209C977402j79076m84916J119752j8085j229053J171237J9655k49561P4380j52205
$$ 3977402 3798326 3313410 4433162 4415077 3186024 4357261 4376916 4127355 4201735 4049530
7199D049530o00915P59716K60206j45343j45109k64991k18727q0960O84155k51128
$$ 4049530 3448615 4208331 4468537 4323194 4178085 3913094 3694367 3613407 4297562 4046434
7189D046434N29279m89064P48184j011173M58914K61754L44001o96078J076647
$$ 4046434 4575713 4086649 4834833 3823660 4282574 4544328 4888329 4192251 5268898
7180E268898l65348J03806J36825j181083J207017j15128k99133R1269k75031
$$ 5268898 4903550 5007356 5144181 3963098 5170115 5054987 4755854 4847123 4572092
7171D572092N99853M48388p90301P32174o78911o03055P43381M10961n97923M18433
$$ 4572092 5171945 5620333 4830032 5562206 4883295 4280240 5023621 5434582 4836659 5255092
7161E255092L90123k11052M12044o54424N02956l43490R99065r57314N5262r4404
$$ 5255092 5645215 5434163 5846207 5191783 5694739 5351249 6350314 5393000 5448262 5353858
7151E353858P65939j001771Q81838k11523R90500n44046l81351m78602r0948O74909
$$ 5353858 6119797 5118026 5999864 5788341 6778841 6234795 5853444 5374842 5283894 5958803
7141E958803p35022R08652k84524J96445N91713l42810m26326k34801K75614M47250
$$ 5958803 5223781 6132433 5847909 6044354 6636067 6293257 5866931 5632130 5907744 6354994
7131F354994K31226o35353N40224n72735Q56401k05749L25294j43607j35274M28459
$$ 6354994 6586220 5950867 6491091 5918356 6774757 6569008 6894302 6750695 6615421 7043880
7121G043880O56563k68188J48809J34942m67434M81692J8729k56511L31380J64503
$$ 7043880 7700443 7432255 7581064 7716006 7248572 7730264 7748993 7492482 7823862 7988365
7111G988365J83981l86287J073911o87855N83942l05331M32591N81736k49266
$$ 7988365 8172346 7786059 8859970 8172115 8756057 8450726 8883317 9465053 9215787
7102I215787m00953M82907j21327J595284j306558K15348J238659k24945j83210
$$ 9215787 8814834 9297741 9176414 10771698 9465140 9680488 10919147 10694202 10510992
7093A0510992j44143P87332L38589p79576J004478p378L21852M33352K68164k39866
$$ 10510992 10366849 11154181 11492770 10713194 11717672 11710294 12032146 12465498 12733662 12493796
7083A2493796O78173q7741M92156q71358J245765j309l55940N50939K67868J05914
$$ 12493796 13171969 13084228 13576384 12705026 13950791 13949482 13593542 14144481 14412349 14518263
7073A4518263L20859l51531L36174o37455P23460l43848P10601k69814m38456
$$ 14518263 14839122 14487591 14823765 14186310 14909770 14565922 15276523 15006709 14568253
7064A4568253J12614n77683L87685j79481m98996J54274K18316O60125M24j52528
$$ 14568253 14680867 14103184 14490869 14311388 13812392 13966666 14184982 14845107 14845531 14693003
7054A4693003j74123k31531q21305J351973n98640M90487o21581j1833N29901
$$ 14693003 14518880 14287349 13466044 14818017 14219377 14709864 14088283 14076450 14606351
7045A4606351p99837J308327J76463J8635P19199n5595M50938J420226l64220
$$ 14606351 13806514 15114841 15291304 15309939 16029138 15973543 16424481 17844707 17480487
7036A7480487J843518R57637M06835Q16753R09173P79905J128925R48239Q15463
$$ 17480487 19324005 20281642 20688477 21505230 22414403 23194308 24323233 25271472 26086935
7027B6086935J333777L19455K23738P51654r1966N99622p4397M28347l56365M25368
$$ 26086935 27420712 27740167 27963905 28715559 28623593 29223215 29148818 29577165 29220800 29646168
7017B9646168K9405j133680k9657L5796P02840K2152O24169N42176m01862J903751
$$ 29646168 29675573 28541893 28512236 28548032 29250872 29273024 29897193 30439369 30037507 31941258
7007C1941258J035157N14399J291534J221044J728240Q33638J148292M66994o30928
$$ 31941258 32976415 33490814 34782348 36003392 37731632 38565270 39713562 40180556 39549628
6998C9549628Q58949j66001L04101p69491o68719j130987j008747q70951j854225
$$ 39549628 40408577 40242576 40546677 39777186 39108467 37977480 36968733 36097782 34243557
6989C4243557o25041k173724p87116o87358L35489j583839k74781L11845k18057
$$ 34243557 33618516 31444792 30657676 29970318 30305807 28721968 28447187 28759032 28540975
6980B8540975J613984n34424J388744J775429J251880J567597J534859J768452
$$ 28540975 30154959 29620535 31009279 32784708 34036588 35604185 37139044 38907496
6972C8907496J986051J790440J665100J981917K259887K457957R79668J738907
$$ 38907496 40893547 42683987 44349087 46331004 48590891 51048848 52028516 53767423
6964E3767423J572660o69289K240969K14783j4737r51595Q12962q37652p21810
$$ 53767423 55340083 54670794 56911763 57126546 57111809 56160214 56973176 56135524 55413714
6955E5413714n55481j316328j84538j20639K79934J00662N53390J176773J696697
$$ 55413714 54858233 53541905 53357367 53236728 53516662 53617324 54170714 55347487 57044184
6946E7044184J681418J126927K597563K029733J381850J247102P76748J708269
$$ 57044184 58725602 59852529 62450092 64479825 65861675 67108777 67885525 69593794
6938F9593794M60965L1464N70303k70483o61585l68652j246753j671081j019874
$$ 69593794 70054759 70086223 70656526 70386043 69724458 69355806 68109053 66437972 65418098
6929F5418098j340729r43602j381791j418445j382771n15997k255381k39862j164946
$$ 65418098 64077369 63133767 61751976 60333531 58950760 58434763 56179382 55939520 54774574
6920E4774574o81267j82936k96493N29288Q06682K509910K224667J845943L269426
$$ 54774574 54093307 53910371 53613878 54143166 54949848 57459758 59684425 61530368 64799794
6911F4799794K883817K326368L580947L240461K910583J828218J880210R48206
$$ 64799794 67683611 70009979 73590926 76831387 79741970 81570188 83450398 84398604
6903H4398604L97427o41134p55536j493433j723463k106640k670840k076911j550448
$$ 84398604 84796031 84154897 83399361 81905928 80182465 78075825 75404985 73328074 71777626
6894G1777626j720416k102186N51391n53076L70791P56297J432086K275431J996878
$$ 71777626 70057210 67955024 68506415 67953339 68324130 69080427 70512513 72787944 74784822
6885G4784822J221138J765668K410209K177913J273315J033721Q13327J199026
$$ 74784822 76005960 77771628 80181837 82359750 83633065 84666786 85480113 86679139
6877H6679139J56937J57563o39007r63436j654650k482105Q8322k446807k241133
$$ 86679139 86836076 86993639 86354632 85391196 83736546 81254441 81342763 78895956 76654823
6868G6654823k180235j909601l212999k513039k428472l347407j755141k609109
$$ 76654823 74474588 72564987 69351988 66838949 64410477 61063070 59307929 56698820
6860E6698820j809358p86425l94624J95321J023924O09437K150635J923914K364804
$$ 56698820 54889462 54103037 53708413 53903734 54927658 55537095 57687730 59611644 61976448
6851F1976448K719468K820246J711363K112920K298937M0390N20851K43902k297660
$$ 61976448 64695916 67516162 69227525 71340445 73639382 73679772 74200623 74444525 72146865
6842G2146865j443722j992473l178266k775932l240638m591739l375565l508162
$$ 72146865 70703143 68710670 65532404 62756472 59515834 54924095 51548530 48040368
6834D8040368l375569k360427k412554j883092p53787k266036j082273q39058
$$ 48040368 44664799 42304372 39891818 38008726 37254939 34988903 33906630 33067572
6826C3067572p85580q5274j16204l10927K37722N28534O97833O72082N61548l15738
$$ 33067572 32281992 32196718 32080514 31769587 32007309 32535843 33233676 33905758 34467306 34151568
6816C4151568K250880Q71078P19149K079113K39584M42044J425432M51589K064266
$$ 34151568 36402448 37273526 37992675 40071788 40311372 40753416 42178848 42630437 44694703
6807D4694703M0142J739944Q53491J431604J774945J428597K266937K130855L700568
$$ 44694703 44734845 46474789 47328280 48759884 50534829 51963426 54230363 56361218 60061786
6798F0061786K161294K784739L432882M271894M864588M397107M008593M833257
$$ 60061786 62223080 65007819 68440701 72712595 77577183 81974290 85982883 90816140
6790I0816140N223835M017393N321606M342192M679182M842913M111256M272085
$$ 90816140 96039975 100057368 105378974 109721166 114400348 119243261 123354517 127626602
6782A27626602L567122L268228L513004J399314K673139R88095J078051o7751
$$ 127626602 131193724 134461952 137974956 139374270 142047409 143035504 144113555 144045804
6774A44045804N3367j660885M42165l034692k060798l109070l114863l709319
$$ 144045804 144099171 142438286 142880451 139845759 137784961 134675891 131561028 127851709
6766A27851709m243062m112280m416802l759147m285541m012666l255727m204955
$$ 127851709 123608647 119496367 115079565 111320418 107034877 103022211 99766484 95561529
6758I5561529k355120k833066l383068k099732j534414k020988j434686j837152
$$ 95561529 93206409 90373343 86990275 84890543 83356129 81335141 79900455 78063303
6750G8063303p94835j983630m39828j041225j259049l90225p66990J44277j588156
$$ 78063303 77268468 75284838 74845010 73803785 72544736 72154511 71387521 71531798 69943642
6741F9943642o9180Q02171j22257J146723l03628Q23240O31308Q02916Q18305
$$ 69943642 69874462 70676633 70554376 71701099 71397471 72220711 72852019 73654935 74473240
6732G4473240K55573K53650M60220J266407q35070P38036m70299r69612o7858
$$ 74473240 74728813 74982463 75442683 76709090 75874020 76612056 76141757 75172145 75104287
6723G5104287j284379M40355o37976l89813N4276j039696K22868k77059M20065
$$ 75104287 73819908 74260263 73622287 73232474 73286750 72247054 72469922 72192863 72612928
6714G2612928n80730q87501P97923l60774j54492n52318r35114r23046j159031
$$ 72612928 72032198 71144697 71942620 71581846 71427354 70875036 69939922 69016876 67857845
6705F7857845n45926k178891j736678j188443k681569k120461j322627q02463
$$ 67857845 67311919 65133028 63396350 62207907 59526338 57405877 56083250 55280787
6697E5280787j947831j196064r79931r11959j926266o64386k63275j140767j026835
$$ 55280787 53332956 52136892 51156961 50245002 48318736 47654350 47391075 46250308 45223473
6688D5223473j013371k63767k286975j013548k040891j189652j786154j645729
$$ 45223473 44210102 43946335 41659360 40645812 38604921 37415269 35629115 33983386
6680C3983386j699533j021362k144739o00546p77981j457378j324184j359701
$$ 33983386 32283853 31262491 29117752 28517206 27739225 26281847 24957663 23597962
6672B3597962p20219M05209j589996J97306q34902o88662j89615j032342j51478
$$ 23597962 22877743 23282952 21692956 21890262 21055360 20366698 20177083 19144741 18993263
6663A8993263l92019j262563M08912n34990q65197j081364j050546n08788P81819
$$ 18993263 18601244 17338681 17747593 17212603 16347406 15266042 14215496 13706708 14488527
6654A4488527j93537l01786j85790k15943p93352N01734P98197m90470O0135o83062
$$ 14488527 14294990 13993204 13807414 13591471 12798119 13299853 14098050 13607580 13667715 12984653
6644A2984653K36451J273068k46931P00724J447657Q32394J91917N54041J261147
$$ 12984653 13221104 14494172 14247241 14947965 16395622 17228016 17419933 17973974 19235121
6635A9235121P59478J253004j35509O10860n0628N84601l7578n29353j05101p39232
$$ 19235121 19994599 21247603 21112094 21722954 21672326 22256927 22219349 21689996 21584895 20845663
6625B0845663K19729j358210m54193j053246O83963j377148l60903Q32258j068000
$$ 20845663 21065392 19707182 19252989 18199743 18883706 17506558 17145655 17977913 16909913
6616A6909913Q39446J034716J376363J473891J409276J716274K408892K023575
$$ 16909913 17749359 18784075 20160438 21634329 23043605 24759879 27168771 29192346
6608B9192346K771549K119499J699722J885795J138764J195267J070924j110866
$$ 29192346 31963895 34083394 35783116 37668911 38807675 40002942 41073866 39963000
6600C9963000L17720k46279j920907k042604k382467k223953k391393k045602
$$ 39963000 40280720 40034441 38113534 36070930 33688463 31464510 29073117 27027515
6592B7027515j374796k254837j221984m92750p02736n0899L42730J068426J156830
$$ 27027515 25652719 23397882 22175898 21683148 20980412 20929513 21272243 22340669 23497499
6583B3497499J501010K585052J638327K133157K322250J428159J513664K207374
$$ 23497499 24998509 27583561 29221888 31355045 33677295 35105454 36619118 38826492
6575C8826492J586972O72698L41738q41163j206515j352261j729303n94772l208709
$$ 38826492 40413464 41086162 41427900 40586737 39380222 38027961 36298658 35703886 32495177
6566C2495177k085194l205132k261666j469167j535749j733879o23712l73085
$$ 32495177 30409983 27204851 24943185 23474018 21938269 20204390 19580678 19207593
6558A9207593j290209M48080q9212M03373j44242J024924Q49639J180060J50113
$$ 19207593 17917384 18365464 18276252 18679625 18535383 19560307 20409946 21590006 21740119
6549B1740119O93853P12696m3261J48023m01041L158l48764K32715j444130j50129
$$ 21740119 22433972 23146668 23103407 23251430 22850389 22853547 22504783 22737498 21293368 21143239
6539B1143239q19811r38795j433947K49692o20504m13896q43087l23863j192245
$$ 21143239 20323428 19384633 17950686 18200378 17579874 17165978 16322891 15999028 14806783
6530A4806783J30294j81255j44601m31101J48456p47568L89741j33062l72825
$$ 14806783 14937077 14755822 14611221 14180120 14328576 13581008 13970749 13837687 13464862
6521A3464862n44165p0505m86741Q07806K30823p14305K3815l01491p80038O92900
$$ 13464862 12920697 12850192 12363451 13171257 13402080 12687775 12711590 12410099 11630061 12322961
6511A2322961L0158Q9622p26681k35198l75219m72627N69348m1235p50131N29634
$$ 12322961 12353119 12442741 11716060 11480862 11105643 10633016 11202364 11161129 10410998 10940632
6501A0940632l91862j25399K58562r07474O79104j19462m69178Q57451m36796
$$ 10940632 10548770 10423371 10681933 9774459 10453563 10334101 9864923 10722374 10285578
6492A0285578J63296J66494j597098N72063o5698O30221r71429O6049j62794l96927
$$ 10285578 10448874 10615368 9018270 9590333 9524635 10154856 9183427 9249476 9086682 8689755
6482H689755M17298o22426o184M56278j234285Q75388L9036p44908P02452o66834
$$ 8689755 9107053 8484627 8478443 8934721 7700436 8575824 8614860 7869952 8572404 7905570
6472G905570N91871L25243p93321o34226J524584n73789K73279l79274J66157
$$ 7905570 8497441 8822684 8029363 7395137 8919721 8345932 8619211 8239937 8406094
6463H406094L85033n13703p82714L03976Q8214m92028P93436o15450k20012P55867
$$ 8406094 8791127 8277424 7494710 7798686 7886900 7394872 8188308 7572858 7352846 8108713
6453H108713n09231K56688J85576M39852r94553K49035O27134j153823J15816
$$ 8108713 7599482 7856170 8041746 8481598 7487045 7736080 8363214 7209391 7325207
6444G325207j38467P30897L40129n81739O10960q06202J054972P1838o524j522851
$$ 7325207 7186740 7917637 8257766 7676027 8286987 7480785 8535757 8607595 8601071 7078220
6434G078220M42311P02767m42553P89657o77050r2507J19510N37123q23700P35227
$$ 7078220 7520531 8223298 7780745 8570402 7893352 7800845 7920355 8457478 7633778 8369005
6424H369005O65618j284060J17455L98326N3729j65893l82708J149127k39562
$$ 8369005 9034623 7750563 7868018 8266344 8320073 8154180 7771472 8920599 8681037
6415H681037n057j46862r895L31770Q8214o76987j44964P02350m1148J35796M3282
$$ 8681037 8675980 8529118 8519223 8850993 8939207 8262220 8117256 8819606 8778458 8914254 8957536
6404H957536k98707N04143m0736J08529j09582J65039L09651J21212n12387L70615
$$ 8957536 8658829 9162972 9122236 9230765 9121183 9286222 9595873 9717085 9204698 9575313
6394I575313L18214p7258o82795M66250J50456l46911m5066N31595l33841o3634
$$ 9575313 9893527 9816269 9133474 9599724 9750180 9403269 9358203 9889798 9555957 9492323
6384I492323K87463p46516O88987j64414M23857N3461k92455l28277M83346n30995
$$ 9492323 9779786 9033270 9722257 9557843 9981700 10035161 9742706 9414429 9897775 9366780
6374I366780R74313K39720N64811p42261k05471P46280j56186K96926J66114K41156
$$ 9366780 10341093 10580813 11145624 10403363 10197892 10944172 10787986 11084912 11251026 11492182
6364A1492182M22911l99495K34515r32024L75912J73614N92828K60317k31554
$$ 11492182 11915093 11515598 11750113 10818089 11194001 11367615 11960443 12220760 11989206
6355A1989206j90827j97133J30271O57403j94789Q968K80133L98730k23232N23634
$$ 11989206 11798379 11601246 11731517 12388920 12194131 12203099 12483232 12881962 12658730 13182364
6345A3182364n11513L40661n64552k97134R60247k36930l05895N58620m23296
$$ 13182364 12670851 13011512 12446960 12149826 13110073 12873143 12567248 13125868 12702572
6336A2702572M24717J60828O64732M25526p31594L85850k10396J83190O55919
$$ 12702572 13127289 13288117 13952849 14378375 13646781 14032631 13822235 14005425 14661344
6327A4661344j47517j51851J89404O77809N34980O05856p80277O32123O65928
$$ 14661344 14513827 14361976 14551380 15229189 15764169 16370025 15589748 16221871 16887799
6318A6887799l06014J16179J113743O37156l08609O56057j09560R72522O75671
$$ 16887799 16581785 16697964 17811707 18448863 18140254 18796311 18686751 19659273 20334944
6309B0334944O20209M43156j97878q78194O79368J82239O6179l36187m97487J15742
$$ 20334944 20955153 21398309 21200431 20322237 21001605 21183844 21250023 20913836 20416349 20532091
6299B0532091n14886j31694l47326j117086R9504L99382o00746k40261K66306
$$ 20532091 20017205 19885511 19538185 18421099 18520603 18919985 18319239 18078978 18345284
6290A8345284r15930r67334P44677J50549p92206j86957J82875J334421q8748
$$ 18345284 17429354 16462020 17206697 17357246 16565040 16378083 16560958 17895379 17806631
6281A7806631j401464J038456L61908n51440j37386L05008j80280K59494K79128
$$ 17806631 16405167 17443623 17805531 17254091 17116705 17421713 17241433 17500927 17780055
6272A7780055L41263n02864k16499K65937M86690j49625k64654j45314q43490
$$ 17780055 18121318 17618454 17401955 17667892 18154582 18004957 17740303 17594989 16751499
6263A6751499R89980N5417J86520P13570p35044J251937p91512j23138m73225
$$ 16751499 17741479 17796896 17983416 18696986 17961942 19213879 18422367 18299229 17826004
6254A7826004N97716K6066o7590J101831q81923J498361j463347Q80831N9308
$$ 17826004 18423720 18449786 18382196 19484027 18602104 20100465 18637118 19517949 19577257
6245A9577257p68636J212335K63118L35642q28169j85034J755827n09433j71107
$$ 19577257 18808621 20020956 20284074 20619716 19791547 19606513 21362340 20852907 20681800
6236B0681800N20756Q85527o61870R98402p85891Q58667M61564J61542O48030
$$ 20681800 21202556 22088083 21426213 22424615 21638724 22497391 22958955 23120497 23768527
6227B3768527K0258L22887Q39147L56272l08836J179308j89733R59671n97194
$$ 23768527 23788785 24111672 24950819 25307091 24998255 26177563 25987830 26947501 26350307
6218B6350307O96374J251941n89480J04892N22031p03316M45618P68865n43166
$$ 26350307 27046681 28298622 27709142 27814034 28336065 27632749 28078367 28847232 28304066
6209B8304066n5147q8660q57462M0680L46226j0980k7817p52520J77221J01297
$$ 28304066 28248919 28160259 27302797 27343477 27689703 27678723 27650906 26898386 27075607 27176904
6199B7176904p09556M4691L1051r870l90511L86066j05019o36204N82550N51345
$$ 27176904 26467348 26512039 26543090 26533220 26142709 26528775 26423756 25787552 26370102 26921447
6189B6921447l91971J33626P55023J20444o62642L77720N59759l59286K22817
$$ 26921447 26529476 26663102 27418125 27538569 26875927 27253647 27813406 27454120 27676937
6180B7676937O26815O41250N8773j375687J497631l30687O94017O89524m32528
$$ 27676937 28303752 28945002 29003775 27628088 29125719 28795032 29489049 30178573 29746045
6171B9746045M97099J63554k49458K05720j91152J173087o14469J186996k04758
$$ 29746045 30243144 30406698 30157240 30362960 30171808 31344895 30730426 31917422 31712664
6162C1712664M11081q4581r383L42192N8031K67116O73696J32802P24129R22249
$$ 31712664 32123745 32039164 32029781 32371973 32430004 32697120 33370816 33503618 34227747 35149996
6152C5149996q26479K89606K53911J116801m41848K11323M49822J179698K25396
$$ 35149996 34323517 34613123 34867034 35983835 35541987 35753310 36203132 37382830 37608226
6143C7608226J13137K66994J028489J34041L46416J734871J67017P24946J765984
$$ 37608226 37721363 37988357 39016846 39150887 39497303 41232174 41399191 42124137 43890121
6134D3890121J038614J708912k36042K793690O72196J173751J560177P82660M05832
$$ 43890121 44928735 46637647 46401605 49195295 49867491 51041242 52601419 53384079 53789911
6125E3789911J842602K6158J313700N72121N67595Q93603J167031J662926R98597
$$ 53789911 55632513 55658671 56972371 57544492 58112087 59005690 60172721 61835647 62834244
6116F2834244K504578J390539J893066J535090K042893K578550J317463J626619
$$ 62834244 65338822 66729361 68622427 70157517 72200410 74778960 76096423 77723042
6108G7723042J577560R40526J418377O95220J056959j37720J219267J223537k09951
$$ 77723042 79300602 80241128 81659505 82354725 83411684 83273964 84493231 85716768 85506817
6099H5506817J122486J088795K099206J062374J240168K129947K102899J022521
$$ 85506817 86629303 87718098 89817304 90879678 92119846 94249793 96352692 97375213
6091I7375213J968196K180938k74016K274108m52991P35236K80924p56569k44549
$$ 97375213 99343409 101524347 101250331 103524439 103071448 103806684 104087608 103331039 103086490
6082A03086490L0548q93150J253067P76581J727313K197950L194207K677082M180244
$$ 103086490 103117038 102223888 103476955 104253536 105980849 108178799 111373006 114050088 118230332
6073A18230332K248205L921801K857852K795546L398136J197112K192987J210748
$$ 118230332 120478537 124400338 127258190 130053736 133451872 134648984 136841971 138052719
6065A38052719L26455J542145o81828L35687l29944J08023m21017K140384J228863
$$ 138052719 138379174 139921319 139239491 139575178 139245234 139353257 138932240 141072624 142301487
6056A42301487K866698L322431L385343N150547N426731Q670463J1860536J2628988
$$ 142301487 145168185 148490616 151875959 157026506 162453237 171123700 182984236 195613224
6048A95613224J3352138J5325933J5211838J6383844J5065589J5560231J3388550
$$ 195613224 208965362 224291295 239503133 255886977 270952566 286512797 299901347
6041B99901347J2255304J3030152R529355O530451L634839K705352R83773N232930
$$ 299901347 312156651 325186803 334716158 341246609 344881448 347586800 348570573 353803503
6033C53803503P305414M376879L050977N765878Q801137J0015583J0165536J2373841
$$ 353803503 361108917 365485796 368536773 374302651 383103788 393119371 403284907 415658748
6025D15658748Q810672Q833214O759616q11076m527401q430509j5311105j7402122
$$ 415658748 424469420 433302634 440062250 439251174 434723773 426293264 410982159 393580037
6017C93580037j9157863k4655246l1061710l1325353l1455986k9608789k4134674
$$ 393580037 374422174 349766928 318705218 287379865 255923879 226315090 202180416
6010B02180416k1543572j8149603j5305501j4150556j1779334j1079749q444257
$$ 202180416 180636844 162487241 147181740 133031184 121251850 110172101 101727844
6003A01727844p468256m400473k350740k918130k084149k24858j110901M55977
$$ 101727844 94259588 89859115 87508375 84590245 82506096 82281238 81170337 81626314
5995H1626314M13079J595648J053631J206750J861532K198804K278241J554747
$$ 81626314 82039393 83635041 84688672 85895422 87756954 89955758 92233999 93788746
5987I3788746K483935J644655K084572J193266P55229J72060J84796o24825r01491
$$ 93788746 96272681 97917336 100001908 101195174 101950403 102122463 102307259 101682434 100780943
5978A00780943j406077j665021j304523j270342j367056j414722j966112J080947
$$ 100780943 99374866 97709845 96405322 95134980 93767924 92353202 90387090 91468037
5970I1468037O78875J550221J551577K279884K653221K432083J886522J528779
$$ 91468037 92146912 93697133 95248710 97528594 100181815 102613898 104500420 106029199
5962A06029199J069782K61623L09434J152301j766071k540676j429768k416331
$$ 106029199 107098981 107360604 107670038 108822339 107056268 104515592 103085824 100669493
5954A00669493l410587k442303l505343m014890l368893l238711j919265k847372
$$ 100669493 97258906 94816603 91311260 87296370 83927477 80688766 78769501 75922129
5946G5922129k294462j512373k516443j761623j194201j354386k560635j679515
$$ 75922129 73627667 72115294 69598851 67837228 66643027 65288641 62728006 61048491
5938F1048491j271676p28298l78453p25837P4173P65688K219145K054577J315304
$$ 61048491 59776815 59048517 58670064 57944227 58018400 58784088 61003233 63057810 64373114
5929F4373114K824229R03534K476443J828384O46887O44558J084657q39034j508334
$$ 64373114 67197343 68100877 70577320 72405704 73052591 73697149 74781806 73942772 72434438
5920G2434438k263384j019904m297386l571572l434403n218696l510484l834893
$$ 72434438 70171054 69151150 64853764 61282192 57847789 52629093 49118609 45283716
5912D5283716l223863l275609k676467k629319j555082k261292m77651j546582
$$ 45283716 42059853 38784244 36107777 33478458 31923376 29662084 29184433 27637851
5904B7637851r05785j278465n14491j44635j144570O46492l03819n15633J55960
$$ 27637851 26732066 25453601 24939110 24794475 23649905 24296397 23992578 23476945 23632905
5895B3632905l93731J65049m81358j02821m8343j171303r2840l12557N5978l03830
$$ 23632905 23239174 23404223 22922865 22820044 22771701 21600398 21507558 21195001 21250979 20947149
5885B0947149L12288p35077J32983j94918K39423m39594j89320N16766o50882
$$ 20947149 21259437 20524360 20657343 20462425 20701848 20262254 20072934 20589700 19938818
5876A9938818K92795k46211N27755j150649L56542j67589N1975j8502n62398j86426
$$ 19938818 20231613 19985402 20513157 19362508 19719050 19551461 19603436 19584934 19022536 18836110
5866A8836110l0527j62416l70964q03903J148468j157696p6321r9717M31590m65678
$$ 18836110 18805583 18643167 18272203 17468300 18616768 17459072 17382751 17283034 17714624 17248946
5856A7248946j39206j74332M12227o59117J84723q44126P66046n12511L90449
$$ 17248946 17109740 16935408 17347635 16688518 16873241 16029115 16795161 16282650 16673099
5847A6673099l80323k39025K50902k5672o9927K23623l35979L98787K48385m56831
$$ 16673099 16292776 16053751 16304653 16278981 16209054 16432677 16096698 16495485 16743870 16287039
5837A6287039L07680l59914l03559K7947K28907N44373q51868p17941J01838J030630
$$ 16287039 16594719 16234805 15931246 15959193 16188100 16732473 15880605 15162664 15264502 16295132
5827A6295132p44765l92502j44613p80678p6322K61760K95257L9235r46227J165194
$$ 16295132 15550367 15157865 15013252 14232574 14156252 14418012 14713269 14752504 13806277 14971471
5817A4971471j057912n0271L61713l17797j23640P3027K41627o80059Q9232J95896
$$ 14971471 13913559 13863288 14225001 13907204 13783564 13856591 14098218 13418159 13507391 13703287
5807A3703287r592J12142R6243P40042r7357J95166l78249M47729K51296L76049
$$ 13703287 13693695 13805837 13902080 14642122 14544765 14739931 14361682 14809411 15060707 15436756
5797A5436756J187783j088386R08922M54074l87372m6025o3799J22109q68351
$$ 15436756 16624539 15536153 16445075 16899149 16511777 16465752 16401953 16524062 15655711
5788A5655711J273527j362790M17957K66217M10823l26660j176691J024136m21942
$$ 15655711 16929238 15566448 15984405 16250622 16661445 16334785 15158094 16182230 15760288
5779A5760288J43364R27913l97313M82290m81315J252984r80917J555472l36910
$$ 15760288 15903652 16831565 16434252 16916542 16435227 17688211 16707294 18262766 17925856
5770A7925856O9930K05382n24314K42502O88571k36602r68121J500605q07751
$$ 17925856 17995786 18201168 17676854 17919356 18607927 18371325 17403204 18903809 18096058
5761A8096058N52485L56980q99882P27753n04397Q41002q08120J98914k70358
$$ 18096058 18648543 19005523 18105641 18833394 18328997 19169999 18361879 18560793 18290435
5752A8290435M59562n970j28471k10336L7436p76155l1426K27864M90062P54216
$$ 18290435 18749997 18744027 18615556 18405220 18442656 17666501 17635075 17862939 18353001 19107217
5742A9107217k60506k91969J78686K95936k83253N39566L68120K59407l02526
$$ 19107217 18846711 18554742 18733428 19029364 18746111 19285677 19653797 19913204 19610678
5733A9610678k12129r77047P15076o98881J163695J71352p89946j38977Q4221
$$ 19610678 19398549 18421502 19136578 18437697 19601392 19772744 18982798 18843821 18928042
5724A8928042r3518Q6650l51522l61516P92484l92693J3240J247870j9702O38619
$$ 18928042 18834524 18921174 18569652 18208136 19000620 18607927 18621167 19869037 19849335 20487954
5714B0487954p15491K23017Q5006Q08883o27554j54327p3072J412705j149199
$$ 20487954 19772463 19995480 20080486 20889369 20261815 20107488 20034416 21447121 20297922
5705B0297922L5188M47904j018698J58120l11438O30058k78114k98557L75270
$$ 20297922 20333110 20781014 19762316 19920436 19608998 20239056 19960942 19662385 20037655
5696B0037655L89946l41432J324282K279l74309P95408Q26844Q16098J068022
$$ 20037655 20427601 20086169 21410451 21412730 21038421 21833829 22660673 23476771 24544793
5687B4544793J196330Q52671K30182J356585K85379J248324J076923k61796J624294
$$ 24544793 25741123 26593794 26823976 28180561 28465940 29714264 30791187 30529391 32153685
5678C2153685n16811M136N67666l23091M44029p82220n41205j496526K66950o45593
$$ 32153685 31636874 31641010 32208676 31885585 32329614 31547394 31006189 29509663 29776613 29131020
5668B9131020L9544j159146q42942r2402l5263J60903J32131N91987K78461M39076
$$ 29131020 29170564 28011418 27168476 27076074 27040811 27201714 27333845 27925832 28204293 28643369
5658B8643369M82845J292520P82532L51015J790064J139809R26136R7278O64255
$$ 28643369 29126214 30418734 31201266 31552281 33342345 34482154 35408290 35505568 36169823
5649C6169823J157769J384699m76349R95030M46250K35012K32231n40719l04963
$$ 36169823 37327592 38712291 38235942 39230972 39677222 39912234 40144465 39603746 39298783
5640C9298783n51052O70077L87307K96976R50794J56125J682059J614178K075727
$$ 39298783 38747731 39417808 39805115 40102091 41052885 41209010 42891069 44505247 46580974
5631D6580974L010638K925013L298450L644174L118937L592030M846818L610307
$$ 46580974 49591612 52516625 55815075 59459249 62578186 66170216 71017034 74627341
5623G4627341L320082L383503L320995K498490J161170P70300O04777j60868m59699
$$ 74627341 77947423 81330926 84651921 87150411 88311581 89081881 89686658 89525790 89066091
5614H9066091r45606j800558j316455j995734k224327j963618n46583j239354
$$ 89066091 88120485 86319927 85003472 83007738 80783411 78819793 78273210 77033856
5606G7033856K76803J262911J399721J786314K716943M448144M315786N648353
$$ 77033856 77310659 78573570 79973291 81759605 84476548 88924692 93240478 98888831
5598I8888831N084532O913569N729678P293843O440921M710344N871936L852899
$$ 98888831 103973363 110886932 116616610 123910453 130351374 135061718 140933654 144786553
5590A44786553L728367J701904J555558p20749j330794k531810l405906m627593
$$ 144786553 148514920 150216824 151772382 151051633 149720839 147189029 143783123 139155530
5582A39155530m251850n932137n392338n154122n063855n557226m049054k967527
$$ 139155530 134903680 128971543 123579205 118425083 113361228 107804002 103754948 100787421
5574A00787421l163276k466747q97638j645591j801J616847J77408K126324K166143
$$ 100787421 97624145 95157398 94259760 92614169 92612368 94229215 94406623 96532947 98699090
5565I8699090J838177J034887K741591K150641J527865K66173P59354m02728j96144
$$ 98699090 100537267 101572154 104313745 106464386 107992251 108258424 109017778 108615050 108418906
5556A08418906j876227l422682k358385l510617l905269m033900m509083m662408
$$ 108418906 106542679 103119997 100761612 97250995 93345726 89311826 84802743 80140335
5548H0140335l697946m259343l920735l189857k647865l439348j686234j922846
$$ 80140335 76442389 72183046 68262311 65072454 62424589 58985241 57299007 55376161
5540E5376161r62536o27650r15428k62367J48881L51232O15867K179014N85667
$$ 55376161 54413625 53785975 52870547 52608180 52757061 53108293 53724160 55903174 56488841
5531E6488841K198843L176055J699727K146463K458473K568938L043137K685679
$$ 56488841 58687684 61863739 63563466 65709929 68168402 70737340 73780477 76466156
5523G6466156K595223K129746K034294K378767J719437J928149J675239J24692
$$ 76466156 79061379 81191125 83225419 85604186 87323623 89251772 90927011 91051703
5515I1051703J802303J569618J314415J688301J419367K765442J969228L430890
$$ 91051703 92854006 94423624 95738039 97426340 98845707 101611149 103580377 107011267
5507A07011267L318137L393843L925045M235696L126117M678704M557050M000167
$$ 107011267 110329404 113723247 117648292 121883988 125010105 129688809 134245859 138246026
5499A38246026L704900K806004K975352K468752J666635Q27293J223783K81255
$$ 138246026 141950926 144756930 147732282 150201034 151867669 152694962 153918745 154200000
5491A54200000j253499R07238l71568p59103k13686j72831J060536R2638K281890
$$ 154200000 152946501 153853739 153482171 152723068 152509382 152336551 153397087 153489725 155771615
5482A55771615J389781J768267P50314J547305R97858N79710J454548o62976j063942
$$ 155771615 157161396 158929663 159679977 161227282 162225140 162804850 164259398 163596422 162532480
5473A62532480j878309l503478l194889l600179n105257m142967o710453n289678
$$ 162532480 160654171 157150693 153955804 150355625 145250368 141107401 134396948 129107270
5465A29107270n384688m344735n525544l466191k399963j490015j957851J015439
$$ 129107270 123722582 119377847 113852303 110386112 107986149 106496134 104538283 105553722
5457A05553722K69334K693239J897596K802803M833847L733058L433805L724640
$$ 105553722 105823056 108516295 110413891 113216694 118050541 121783599 125217404 128942044
5449A28942044K591429L154482K777307N39108P37887p52516j468665k100093
$$ 128942044 131533473 134687955 137465262 138004370 138742257 137989741 136521076 134420983
5441A34420983l866568l963451m595707l862967n318557n179515n565215n227077
$$ 134420983 130554415 126590964 121995257 118132290 112813733 107634218 102069003 96841926
5433I6841926l257028l894768l219021k484625j011710k91990r49304J188256
$$ 96841926 93584898 89690130 86471109 83986484 82974774 82682784 81733480 82921736
5425H2921736O96682J874656K323225J367420K622055K387944J460285J017560
$$ 82921736 83618418 85493074 87816299 89183719 91805774 94193718 95654003 96671563
5417I6671563J028530J22040M68041j974730j675561k722957k650709m027360
$$ 96671563 97700093 97822133 98290174 96315444 94639883 91916926 89266217 85238857
5409H5238857m277252m375616m225976n257725m342907m302022m145004l403446
$$ 85238857 80961605 76585989 72360013 67102288 62759381 58457359 54312355 50908909
5401E0908909l554229l080828k656610j868132l334926r43732k110399j206669
$$ 50908909 47354680 44273852 41617242 39749110 36414184 35470452 33360053 32153384
5393C2153384j100698r01679r43566n17202M65265j080154p05137j95330j41571
$$ 32153384 31052686 30151007 29207441 28690239 29155504 28075350 27370213 27174883 27033312
5384B7033312q95047q0775l73688m97375J05333k03051m564k68086l20207K61242
$$ 27033312 26138265 26057490 25683802 25186427 25291760 25088709 25084145 24816059 24495852 24757094
5374B4757094n52920P2498l77553q4291n7977Q8476n8577l45255P08401j109141
$$ 24757094 24204174 24276672 23899119 23814828 23756851 23845327 23786750 23441495 24149896 23040755
5364B3040755J64481o87863l59640J130093j863527K08321p66574J16938r78471
$$ 23040755 23205236 22517373 22157733 23287826 21424299 21632620 20866046 20982984 20004513
5355B0004513q85742N68464o80241Q727j79613j26816P19797j53870k98568O02906
$$ 20004513 19118771 19687235 19006994 19015721 18836108 18709292 19429089 19275219 18976651 19579557
5345A9579557O8585J45178J44300O49370L17877J91574K28438k86394J002908
$$ 19579557 19648142 19793320 19937620 20586990 20904867 21096441 21324879 21038485 22041393
5336B2041393n52884m1922n77523J510279j164062j708054n077J005251p34551
$$ 22041393 21488509 21446587 20869064 22379343 21215281 19507227 19502150 20507401 19772850
5327A9772850q31106n79105l30887m63862k53500l87686n25371l04506k06127
$$ 19772850 18941744 18362639 18031752 17567890 17314390 16926704 16401333 16096827 15890700
5318A5890700K12791o59956M98311m97633K03102K79J08977M72592j108263J170465
$$ 15890700 16103491 15443535 15941846 15444213 15647315 15647594 15756571 16229163 15120900 16291365
5308A6291365L94543n33524K81018L36645j58646o33262l97998K91115M8152j643433
$$ 16291365 16685908 16152384 16433402 16770047 16611401 15978139 15580141 15871256 15919408 14275975
5298A4275975K55429j18532j39324l18713r27232O62194m13115k38502r16p77137
$$ 14275975 14531404 14412872 14273548 13954835 13027603 13689797 13276682 13038180 13037264 12260127
5288A2260127N10842m62923Q3721K22477L16172m74121l10633j98882N05715K68286
$$ 12260127 12770969 12308046 12391767 12614244 12930416 12456295 12145662 11946780 12452495 12720781
5278A2720781o63525R02410M13944N87106m69619O3189M22734R65792J47073J68471
$$ 12720781 12057256 12959666 13373610 13960716 13491097 13554286 13977020 14942812 15089885 15258356
5268A5258356O80466M45858K21556Q44291N88873k07835J018498L2694J244764
$$ 15258356 15938822 16384680 16606236 17450527 18039400 17831565 18850063 18882757 20127521
5259B0127521J466670K72108R32259K06618J632695K494946J364445J792159K794446
$$ 20127521 21594191 21866299 22798558 23005176 24637871 27132817 28497262 30289421 33083867
5250C3083867K060383K714380K298556L456119K310913L963009L015697K795345
$$ 33083867 35144250 37858630 40157186 43613305 45924218 49887227 52902924 55698269
5242E5698269L592609L317471L503371K644044K198265J575409L462944K574838
$$ 55698269 59290878 62608349 66111720 68755764 70954029 72529438 75992382 78567220
5234G8567220J661843J955802J977508K054969K344545J616155J873923L106166
$$ 78567220 80229063 82184865 84162373 86217342 88561887 90178042 92051965 95158131
5226I5158131L717754K501724K721732M064885L959053L553728L300445M050749
$$ 95158131 98875885 101377609 104099341 108164226 112123279 115677007 118977452 123028201
5218A23028201K301803L196475J443163J572001K71544P56839k152740r78329
$$ 123028201 125330004 128526479 129969642 131541643 131813187 132570026 130417286 129438957
5210A29438957k077527l251381l733183k453069m402618l693638l955495l984288
$$ 129438957 127361430 124110049 120376866 117923797 113521179 109827541 105872046 101887758
5202A01887758k860619l433640j448718k124428q50618j994475j141198l780q62479
$$ 101887758 99027139 95593499 94144781 92020353 91169735 89175260 88034062 88030282 87167803
5193H7167803q48468m10881j267339m74653k385443j306369j565231l038699l230899
$$ 87167803 86319335 85908454 84641115 84166462 81781019 80474650 78909419 75870720 72639821
5184G2639821k581175l616350k518926l390285k585865l157704l512597k108733
$$ 72639821 70058646 66442296 63923370 60533085 57947220 54789516 51276919 49168186
5176D9168186k986031k408268j778609k198046k406488j197603j358436k196398
$$ 49168186 46182155 43773887 41995278 39797232 37390744 36193141 34834705 32638307
5168C2638307r79494j432064p81130j419130p43378j267617j027209r47902o17727
$$ 32638307 31658813 30226749 29445619 28026489 27283111 26015494 24988285 24040383 23422656
5159B3422656j22945j204115J16772q15901o77562n92612o37780r498j025973
$$ 23422656 23299711 22095596 22212368 21396467 20718905 20126293 19488513 19479015 18453042
5150A8453042k41532j93954j219316K56153j070477K39205j187878L09268j829528
$$ 18453042 18211510 18017556 16798240 17054393 15983916 16223121 15035243 15344511 13514983
5141A3514983J73290P37863m03171j740665m5421M81168p14859J60314j08355
$$ 13514983 13688273 14426136 14022965 12282300 12236879 12718047 12003188 12163502 12055147
5132A2055147q07920p0617k29296M78891L18467o62068J87925j11100J625988
$$ 12055147 11247227 11176610 10947314 11426205 11744672 11082604 11270529 11159429 12785417
5123A2785417j302145k54195J17026J2380K40497n93535Q09925l42859o2240J23120
$$ 12785417 11483272 11229077 11346103 11358483 11598980 11005445 11815370 11472511 11410271 11533391
5113A1533391J5958q4159r5110r17480J171035l12959l90416J102016q08857M41938
$$ 11533391 11549349 11465190 11370080 10452600 11623635 11310676 10920260 12022276 11213419 11655357
5103A1655357j90483J83782j39726O12556r5856m57913M44551J09209k92769L67112
$$ 11655357 11464874 11648656 11508930 12121486 12025630 11567717 12012268 12121477 11828708 12195820
5093A2195820k18017P0318l82878P54010P6550o9105l40497J055698j34724j13058
$$ 12195820 11977803 12048121 11665243 12419253 12495803 12426698 12086201 13141899 13007175 12894117
5083A2894117l95566k65334O63960K6749q6350K47390o85523L5276M78664m42113
$$ 12894117 12498551 12233217 12897177 12923926 12837576 13084966 12399443 12434719 12913383 12471270
5073A2471270Q31920l30311K22044j9123l81008j09408J66463P15903o14339m4842
$$ 12471270 13303190 12972879 13194923 13175800 12794792 12685384 12851847 13567750 12953411 12908569
5063A2908569k10971Q74489K51879M77469M54382K30039j68710k89084N47966
$$ 12908569 12697598 13572087 13823966 14301435 14755817 14985856 14817146 14528062 15076028
5054A5076028L50909n02167J117627M87155O8785N42726M09027l28657R68136
$$ 15076028 15426937 14924770 16042397 16529552 16598337 17141063 17550090 17221433 18189569
5045A8189569J4332J07689M25192k22955O74152o77660J034234P38074J734008
$$ 18189569 18203901 18311590 18736782 18513827 19187979 18510319 19544553 20282627 22016635
5036B2016635m2545J055539J265178J266606J552046J442123J404022K572116
$$ 22016635 21974090 23029629 24294807 25561413 27113459 28555582 29959604 32531720
5028C2531720J436321J771874J042604J619632J460263J169542R81702J38410
$$ 32531720 33968041 35739915 36782519 38402151 39862414 41031956 42013658 42152068
5020D2152068P65893J582400o70963J1856n718M107p99755j03255l66400N48990
$$ 42152068 42917961 44500361 43829398 43841254 43835536 43839643 43039888 42936633 42570233 43119223
5010D3119223R09285Q61309K087823O77655J773346J914704L024572M351222K736186
$$ 43119223 44028508 44889817 46977640 47655295 49428641 51343345 54367917 58719139 61455325
5001F1455325M372258K996096N132478L117808L949854L307354K985300K645283
$$ 61455325 65827583 68823679 73956157 77073965 81023819 84331173 87316473 89961756
4993H9961756J713480J048149J227536m93044j346508r49264j864235j823610
$$ 89961756 91675236 92723385 93950921 93457877 92111369 91162105 89297870 87474260
4985H7474260k317366k534861k496336j916205k018300j586616j61155k64864
$$ 87474260 85156894 82622033 80125697 78209492 76191192 74604576 74443421 74178557
4977G4178557N07573J734606J475079K029715L798748L473030M175040M487136
$$ 74178557 74686130 76420736 77895815 79925530 83724278 87197308 91372348 95859484
4969I5859484M171067N319582L592386M075808M721805L049009L560222J816826
$$ 95859484 100030551 105350133 108942519 113018327 117740132 120789141 124349363 126166189
4961A26166189L978790N051377N551037M960481N069867N037916N928507N273336
$$ 126166189 130144979 135196356 140747393 145707874 150777741 155815657 161744164 167017500
4953A67017500L810214N627049K591556K981411L610232r23624l25121l873734
$$ 167017500 170827714 176454763 179046319 182027730 185637962 184714338 184389217 180515483
4945A80515483l981041n762139o483229o944992j0421491r885380j0359408q479176
$$ 180515483 176534442 170772303 164289074 157344082 146922591 137037211 126677803 118198627
4937A18198627o050684o444711n699000n097779m927769m863124m836071n281865
$$ 118198627 112147943 105703232 100004232 94906453 89978684 85115560 80279489 74997624
4929G4997624m550766m316663m121622l989536l604462l983858l033650l591903
$$ 74997624 70446858 66130195 62008573 58019037 54414575 50430717 47397067 43805164
4921D3805164k671348l064034j092493k968602j655054o28234j413687r20273
$$ 43805164 41133816 38069782 36977289 34008687 32353633 31725399 30311712 29391439
4913B9391439M50006j128819Q2771m45534n37708L84011O52389j06681l85793
$$ 29391439 29841445 28712626 28795397 28349863 27812155 28196166 28848555 28741874 28356081
4904B8356081O07458j416543P74179j145226l62314p10975l09294o22336q11032
$$ 28356081 28963539 27546996 28321175 27175949 26813635 26102660 25793366 25171030 24359998
4895B4359998n95918n49044j036198m50263j19142l68965m58240p42599J050764
$$ 24359998 23764080 23215036 22178838 21728575 21609433 21240468 20782228 20039629 21090393
4886B1090393o45312l81001J274082m26610o5974m33069N43261n45640J539443
$$ 21090393 20445081 20064080 21338162 20911552 20845578 20412509 20955770 20410130 21949573
4877B1949573q79227M6469l57581O51238m78110L36644k53678k50928J19612k60897
$$ 21949573 21070346 21116815 20759234 21410472 20932362 21269006 21015328 20764400 20884012 20623115
4867B0623115k31171K66555p94379l6004L67563m50337N69745L92648l17452K77110
$$ 20623115 20391944 20658499 19864120 19828116 20195679 19745342 20315087 20707735 20390283 20667393
4857B0667393Q3732k202L44708n94829l88176P49090O4510o17114l63366k84567
$$ 20667393 20751125 20748923 21093631 20498802 20110626 20859716 20924226 20307112 19943746 19659179
4847A9659179n39350N74919o47979N44803j40259m67151j14645o7811N6943j13828
$$ 19659179 19119829 19694748 19046769 19591572 19451313 18984162 18869517 18801706 18858649 18744821
4837A8744821N59847K57958P36581m71612N81200k54927R21644P16670M30074
$$ 18744821 19304668 19562626 20299207 19827595 20408795 20153868 21075512 21792182 22222256
4828B2222256K95177L10194j39589J371014j90924K86701M66973J598458J35264
$$ 22222256 22517433 22827627 22688038 24059052 23868128 24154829 24621802 26220260 26355524
4819B6355524N43219Q73003N53612N07111J048503J394429J6968O34366J533089
$$ 26355524 26898743 27771746 28325358 28832469 29880972 31275401 31292369 31926735 33459824
4810C3459824P42521J507804P21340J575153M42919J014462J284476J250820J214122
$$ 33459824 34202345 35710149 36431489 38006642 38449561 39464023 40748499 41999319 43213441
4801D3213441J350309J58354J739390R56651J180694J525092J594358J242182
$$ 43213441 44563750 44722104 46461494 47418145 48598839 50123931 51718289 52960471
4793E2960471K019343J569148J429269J303276K221034J406943K503519J069837
$$ 52960471 54979814 56548962 57978231 59281507 61502541 62909484 65413003 66482840
4785F6482840K856059K220244K225281K675252L439759J535018L738329K533247
$$ 66482840 69338899 71559143 73784424 76459676 79899435 81434453 85172782 87706029
4777H7706029L291420K801492K974462K959641K243199L029270J633451K925664
$$ 87706029 90997449 93798941 96773403 99733044 101976243 105005513 106638964 109564628
4769A09564628K230471L469961P92557K264795L476996K150835J527680L167080
$$ 109564628 111795099 115265060 116057617 118322412 121799408 123950243 125477923 128645003
4761A28645003L997519K607607M209718L812781N274544M506787M473128N134323
$$ 128645003 132642522 135250129 139459847 143272628 148547172 153053959 157527087 162661410
4753A62661410N661622N241354L851361N622910L165033L897450L904111L082659
$$ 162661410 168323032 173564386 177415747 183038657 186203690 190101140 194005251 197087910
4745A97087910J158346K430263M26858j86872L5907K93595j719401j009985j338546
$$ 197087910 198246256 200676519 201103377 200916505 200952412 201246007 199526606 198516621 197178075
4736A97178075j036111r98605m72849m87248j063971j576152l86130m47931j987442
$$ 197178075 196141964 195143359 194670510 194183262 193119291 191543139 191157009 190709078 188721636
4727A88721636j763635k368272j637075j931647m308426m054166l512337n354929
$$ 188721636 186958001 184589729 182952654 181021007 176712581 172658415 169146078 163791149
4719A63791149m896775n349971n478081n826012n657336n647076o380982m369644
$$ 163791149 158894374 153544403 148066322 142240310 136582974 130935898 124554916 120185272
4711A20185272m371317l686441m505512k835132k709923l413232k850355l053285
$$ 120185272 115813955 112127514 107622002 104786870 102076947 98663715 95813360 92760075
4703I2760075k158120j048987k515425k406295j165653k248744j185663k700595
$$ 92760075 90601955 89552968 87037543 84631248 83465595 81216851 80031188 77330593
4695G7330593j035361k920161j821805k024912j971360j795097j673729k493457
$$ 77330593 76295232 73375071 71553266 69528354 67556994 65761897 64088168 61594711
4687F1594711k121001r80186j476555j416263j921742j195634j147206k00626
$$ 61594711 59473710 58493524 57016969 55600706 53678964 52483330 51336124 51135498
4679E1135498j497847l70957p81764k33718m90731j065198j10196p97411J04678
$$ 51135498 49637651 49266694 48484930 48251212 47760481 46695283 46585087 45787676 45892354
4670D5892354j786709Q66156p01233q24661O92668l18361q15063r47123n06141
$$ 45892354 44105645 44971801 44270568 43445907 44138575 43820214 43005151 42058028 41551887
4661D1551887N64325j200024j2118m47291j235446o77384m95830N0264k380133
$$ 41551887 42116212 40916188 40904070 40456779 39221333 38543949 38048119 38098383 35718250
4652C5718250j01829J03942l17003j506117n85465p04582L57664j756007M77144
$$ 35718250 35616421 35720363 35403360 33897243 33311778 32607196 32964860 31208853 31685997
4643C1685997j814962J11861o35502n79375p48006k11032j238376m39612j51242
$$ 31685997 29871035 29982896 29347394 28768019 28020013 27808981 26570605 26130993 25979751
4634B5979751r45181q73495j091230J50406j072586j49865l72926n39626p61616
$$ 25979751 25034570 24161075 23069845 23220251 22147665 21997800 21624874 21085248 20323632
4625B0323632M29164o33489m77877l31076M22430k58967k81296n96175p17100
$$ 20323632 20752796 20119307 19641430 19310354 19732784 19473817 19192521 18596346 17879246
4616A7879246m88293J038241j469339J883139k685711L58008m04604j74700J38184
$$ 17879246 17390953 18429194 16959855 18842994 16157283 16515291 16110687 15935987 16074171
4607A6074171o95944m41272j06092l82585J18915q01558K98925l43917j172519
$$ 16074171 15378227 14936955 14830863 14448278 14567193 13765635 14064560 13720643 12548124
4598A2548124j45783N13201k93649j160911o13654N21891k91607j56369m07655
$$ 12548124 12402341 12915542 12621893 11460982 10847328 11369219 11077612 10921243 10513588
4589A0513588L53317r85658N38933n25619O60663k30126j97582L63863n30350
$$ 10513588 10866905 9881247 10420180 9894561 10555224 10325098 10127516 10491379 9961029
4580I961029k1316r32679K03519k4848r8070p29076l617Q35751j91588j85159
$$ 9961029 9939713 9007034 9210553 9185705 9087635 8358559 8354942 9190693 8999105 8813946
4570H813946m26661j11157K5950k38784M10367m01299N00190p864m38180j87098
$$ 8813946 8387285 8276128 8302078 8063294 8473661 8072362 8572552 8564688 8126508 7939410
4560G939410k57390P13011n84426M16988m39766N43270j45249M07143l96639p54077
$$ 7939410 7682020 8395031 7810605 8227593 7787827 8331097 8185848 8592991 8196352 7442275
4550G442275j35098n50371O31729k44967M18503j01817j68136n04563O03973p38470
$$ 7442275 7307177 6756806 7388535 7143568 7562071 7460254 7292118 6787555 7391528 6653058
4540F653058M57954n31309j49572j6641P10735k0774p00755J097277j226482J135058
$$ 6653058 7111012 6579703 6430131 6413490 7124225 7103451 6402696 7499973 6273491 7408549
4530G408549q49623O82743p12512o14458N68450O98859m90145K7235l61078n9720
$$ 7408549 6558926 7241669 6529157 5914699 6483149 7182008 6691863 6719098 6358020 6298300
4520F298300K2848K65885j76701J40896K10049j148798O85607r39940J016055
$$ 6298300 6321148 6587033 6410332 6551228 6761277 5612479 6298086 5358146 6374201
4511F374201j105113P90054j167186J095842j65178j65341O3353Q3333L61947
$$ 6374201 5269088 6059142 4891956 5987798 5822620 5657279 5720632 5803965 6165912
4502F165912r2825l96051M68981n14738K34980K15665K3509J03647j22292l18939
$$ 6165912 6073087 5677036 6146017 5631279 5866259 6081924 6105433 6209080 6086788 5767849
4492E767849j59112K9791L73233r2293J151231n10388k62702K45655m11725N04143
$$ 5767849 5608737 5638528 6011761 5919468 7070699 6560311 6297609 6543264 6131539 6635682
4482F635682m82600Q56460r97784Q85181J00098P24669r35932j284l8555M34467
$$ 6635682 6153082 7009542 6011758 6896939 6997037 7721706 6785774 6784490 6745935 7180402
4472G180402k53450L3071J41016P7378O1867m97048P49042l51450N24455r6718
$$ 7180402 6926952 6960023 7101039 7178417 7240284 6743236 7492278 7140828 7665283 7568565
4462G568565p21463O55177n25373N54291j72536O56006j97903k20164j03783J29465
$$ 7568565 6847102 7502279 6976906 7531197 7358661 8014667 7816764 7596600 7492817 7622282
4452G622282j193364Q81246p13853o4196q566l0846j2256Q47914l24435l20227
$$ 7622282 6428918 7310164 6596311 6532115 6523549 6492703 6480447 7328361 7003926 6683699
4442F683699J18920o6167k23354O16084k9134M98263k04880J37516N95583k48903
$$ 6683699 6802619 6736452 6513098 7129182 7100048 7598311 7393431 7530947 8126530 7877627
4432G877627P5372L99711O50013p04223N88668k25216O40930p35595K27420O36220
$$ 7877627 7952999 8352710 9002723 8298500 8887168 8661952 9302882 8567287 8794707 9430927
4422I430927m71511K30633k63199n9755L72825m53454o16007m11540L48732o69791
$$ 9430927 8959416 9190049 8926850 8867095 9239920 8786466 8170459 7758919 8107651 7437860
4412G437860K64492J97281m32920n8308J14330m51567k73676r501M25611M33765
$$ 7437860 7702352 7899633 7466713 7408405 7522735 7071168 6797492 6787991 7213602 7647367
4402G647367k12649J271375j379193M41022P15241J99511j403263J691924j285526
$$ 7647367 7434718 8706093 7326900 7767922 8483163 8682674 7279411 8971335 7685809
4393G685809P01948K04080J57454J48838n26992K41181R04177r86745Q78469J10481
$$ 7685809 8387757 8591837 8749291 8898129 8371137 8612318 9516495 8529750 9408219 9518700
4383I518700K73997m304N75406p71662J233715J84924r29593P10747J142346L58803
$$ 9518700 9792697 9788393 10363799 9592137 10825852 11010776 10081183 10791930 11934276 12293079
4373A2293079N30732j48340K28050J003203R50423N35162J448384Q29956J422487
$$ 12293079 12823811 12675471 12903521 13906724 14857147 15392309 16840693 17670649 19093136
4364A9093136J142937L313168K550397K223851K752804K791445K290953L360337
$$ 19093136 20236073 23549241 26099638 28323489 31076293 33867738 36158691 39519028
4356C9519028L402404J561289K028466J546701P77734N67562p56611m31241q23027
$$ 39519028 42921432 44482721 46511187 48057888 48835622 49403184 48646573 48215332 47392305
4347D7392305o74486k210524k403449k008431k848385j814177M24843r33843L0784
$$ 47392305 46717819 44507295 42103846 40095415 37247030 35432853 35857696 34923853 34954637
4338C4954637j34918J362694K993275K787983M945113M565010M927313O332175
$$ 34954637 34819719 36182413 39175688 41963671 46908784 51473794 56401107 62733282
4330F2733282N243061N610436N796505M501345M666398M669254J835482J704715
$$ 62733282 67976343 73586779 79383284 83884629 88551027 93220281 95055763 96760478
4322I6760478L44784j172472k255861k838513m707822m719115o143248o087948
$$ 96760478 97105262 95932790 93676929 90838416 86130594 81411479 75268231 69180283
4314F9180283n849461m709241m427033k994173l580472l180489j946680k357804
$$ 69180283 63330822 58621581 54194548 51200375 47619903 44439414 42492734 40134930
4306D0134930n60119k62625Q76389O4683R95449R42748K74183J339534J134200
$$ 40134930 39574811 39312186 40188575 40253258 41248707 42191455 42465638 43805172 44939372
4297D4939372j71632Q02940j137850n0591j631339j770966j643494k771738l355339
$$ 44939372 44767740 45570680 44432830 44382239 42750900 40979934 39336440 36564702 33209363
4288C3209363k490131k208485l311962k686592k741882r81100j539402j618214
$$ 33209363 30719232 28510747 25198785 22512193 19770311 18789211 17249809 15631595
4280A5631595j688447j845944n18506j009871o25342n27478m58438p42811o58624
$$ 15631595 13943148 12097204 11578698 10568827 9943485 9416007 8957569 8214758 7556134
4271G556134k80924m31403m41939k96141J63230q24847K97370l86644j245022
$$ 7556134 7275210 6843807 6401868 6105727 6268957 5444110 5741480 5354836 4109814
4262D109814R66475j014756J94069J43983M3807p83199N71137l47582j90119M3504
$$ 4109814 5076289 4061533 4255602 4399585 4443392 3660193 4231330 3883748 3693629 3737133
4252C737133n87156L21118j10807M77424k61602k04073n73073L0801n70319J8475
$$ 3737133 3149977 3471095 3360288 3837712 3576110 3372037 2798964 2829765 2259446 2277921
4242B277921P0294J172722j261064j57192M56725p21607J70730j1186o03071P12923
$$ 2277921 2348215 3520937 2259873 2102681 2559406 1837799 2008529 1997343 1394272 2107195
4232B107195J03302P00165r88907l48587j61061M69657m18661m38196J42128k35271
$$ 2107195 2210497 2910662 1921755 1573168 1412107 1881764 1463103 1024907 1167035 931764
4222I31764N94868l13748L48557Q4106P39494j656472N34605O1387n40205j60409
$$ 931764 1526632 1212884 1561441 1645547 2385041 728569 1263174 1324561 784356 623947
4212F23947j98603O3823N84062l81487j52370j95718j70946L11717O37089l60199
$$ 623947 425344 489167 1073229 691742 539372 343654 172708 484425 1121514 761315
4202G61315r2038o17863J78104J08499J43784p6576m1806m38086M85919L24652
$$ 761315 669277 51414 229518 338017 481801 405225 363419 -74667 411252 735904
4192G35904j95798k91591K16546N69319m44595k13516q25874K29402N0711k2016
$$ 735904 540106 248515 465061 1034380 589785 376269 -449605 -220203 -169492 -191508
4182a91508M26367j8740J51177L32962o50695k34755J280007o22463J98863l49711
$$ -191508 234859 216119 367296 700258 49563 -185192 1094815 472352 671215 321504
4172C21504j38868m7447P7543q45235R62519k2558m59955J66591p33155Q47219
$$ 321504 182636 135189 212732 -632503 330016 307458 -152497 14094 -719061 128158
4162A28158N2833l80m5098k76035K26566j43676N16714j033686Q70175k56943
$$ 128158 180991 180611 135513 -140522 86044 -57632 459082 -574604 295571 38628
4152C8628P62779j163410M02941k6447K72809J4481j061271J146836q33830O09817
$$ 38628 801407 -362003 40938 14491 287300 301781 -759490 387346 -446484 163333
4142A63333k73885O83486k88545j86781J00444j35952k01355M59911m95202K86403
$$ 163333 -110552 572934 284389 97608 198052 62100 -139255 320656 -174546 111857
4132A11857n39682J027626k19427p51047j20574J85583K84105J3210J56586m12676
$$ 111857 -427825 599801 380374 -370673 -491247 -305664 -21559 -8349 148237 -264439
4122b64439m43405P67856l18866l6224O57758O14704p10460R169j38878M70835
$$ -264439 -707844 60012 -258854 -295078 362680 977384 266924 276093 137215 608050
4112F08050l06618P8211P84038n63237j077358M7129P07687J52061p1660k55500
$$ 608050 301432 379643 1163681 600444 -476914 -429785 277902 429963 358303 102803
4102A02803N39876K15064l71540J31304p1696L2786L92045o25955K53282r12240
$$ 102803 642679 857743 486203 617507 545811 578597 970642 344687 597969 -314271
4092c14271J157652J97222n14377P51324r82128R17587K85097o96891O5914K17738
$$ -314271 843381 1040603 526226 1277550 295422 1213009 1498106 801215 867129 1084867
4082A084867N0300M46409o07506K00238j00826O4385N9100P63315r64526R25891
$$ 1084867 1135167 1581576 974070 1174308 1073482 1137867 1196967 1960282 995756 1921647
4072A921647p96943J25799J52546k86146l15473J128036m52187J11160L77353
$$ 1921647 1124704 1250503 1403049 1116903 801430 1929466 1477279 1588439 1965792
4063A965792O54487p09000M51656k05646m5037Q66802m27944K58755M60115Q26432
$$ 1965792 2620279 1911279 2362935 2157289 2112252 2979054 2551110 2809865 3269980 4096412
4053D096412j603193M08871R03329j316568J764864j287370J62815O8051Q50057
$$ 4096412 2493219 2902090 3805419 2488851 4253715 2966345 3129160 3197211 4047268
4044D047268j16703l34217M60242m56109L29248l4982J90382k90775P26724o04215
$$ 4047268 3930565 3596348 4056590 3600481 3929729 3894747 4085129 3794354 4521078 3916863
4034C916863n44569Q53285J23210L40562M0231N59117J09649k12448j5852j78386
$$ 3916863 3372294 4225579 4348789 4689351 4729582 5288699 5398348 5185900 5170048 4991662
4024D991662j64215J092432n32336J45078n14601m83449N96688p62044L53225
$$ 4991662 4827447 5919879 5387543 5532621 5018020 4534571 5131259 4369215 4722440
4015D722440n04959l0858l13804M40275L84940j229897O11055m17019l7043L24638
$$ 4722440 4217481 4186623 3872819 4313094 4698034 3468137 4079192 3662173 3625130 3949768
4005C949768J85315r0765p44640l77117O52474K14738k09462R00094j043747K20743
$$ 3949768 4135083 4044318 3299678 2922561 3575035 3789773 3580311 4480405 3436658 3657401
3995C657401r46948n3747M98485j44271q29064O28724l4930K22402j174727N58190
$$ 3657401 2710453 2656706 3155191 3010920 2181856 2810580 2775650 2998052 1823325 2381515
3985B381515m49408l73936J7545n5275n6016N2162q45921M85531Q53866j170873
$$ 2381515 1932107 1558171 1575716 1520441 1464425 1516587 670666 1156197 2010063 839190
3975H39190M58844o89814o8866O61067k0764o70484k24486l06447N67474j31353
$$ 839190 1298034 608220 539354 1200421 1179657 509173 284687 -21760 545714 414361
3965D14361j133019Q52951n44212P36582l63619M68122m9826q91466O22863m80753
$$ 414361 -718658 134293 -409919 326663 -36956 431166 381340 -510126 112737 -368016
3955c68016O9012R2163p98144K93459l54322O23773J81960j52254p1618p00151
$$ -368016 -299004 -206841 -1004985 -711526 -1065848 -442075 -260115 -412369 -483987 -1184138
3945a184138M36597J49754m88938L62587K75883n90726K71031J37989p56874O6917
$$ -1184138 -747541 -597787 -1086725 -724138 -448255 -1038981 -767950 -629961 -1386835 -1319918
3935a319918J38710L45481n65767m1317j58918O39499P93479m95510o92261L33524
$$ -1319918 -1181208 -835727 -1401494 -1442811 -1601729 -962230 -168751 -664261 -1356522 -1022998
3925a022998l93910k6452J78255R8943l25488q5626J147690j076960M52870l52197
$$ -1022998 -1416908 -1443360 -1265105 -1166162 -1491650 -1577276 -429586 -1506546 -1053676 -1405873
3915a405873k66403J59996M9988P20600j026926J88987R17777J71608o29124N2500
$$ -1405873 -1672276 -1512280 -1462292 -741692 -1768618 -1579631 -661854 -490246 -1119370 -1066870
3905a066870O25172r16924j21434K34030K17348j6134J57378l01589l698J93736
$$ -1066870 -441698 -1358622 -1480056 -1246026 -1028678 -1044812 -887434 -1189023 -1192721 -998985
3895i98985o102o54588r2774k15047Q22131l24032k52822P46052O28558n30812
$$ -998985 -1005087 -1659675 -1752449 -1967496 -1145365 -1469397 -1722219 -976167 -347609 -878421
3885h78421k71751K16746p47207l02401R51171p69631L83444P0247m66426M53329
$$ -878421 -1150172 -933426 -1680633 -1983034 -1031863 -1801494 -1418050 -1347803 -1814229 -1360900
3875a360900N60378o41061j83252L12089r19161J255387K13848M1837o38741K99614
$$ -1360900 -800522 -1441583 -1624835 -1312746 -2231907 -976520 -762672 -720835 -1359576 -1059962
3865a059962m65488l54822J76951N06884j69206O2027j3334j80309N69717j78939
$$ -1059962 -1525450 -1880272 -1703321 -1196437 -1365643 -1303616 -1316950 -1497259 -927542 -1106481
3855a106481k77695r205N07314n38889L48572p87859P28939j37577j79863M85387
$$ -1106481 -1384176 -1393381 -886067 -1424956 -1076384 -1864243 -1135304 -1272881 -1452744 -967357
3845i67357n78645K69845k66270N51891p13518Q91873j035647L8220L68790j09467
$$ -967357 -1546002 -1276157 -1542427 -990536 -1704054 -812181 -1847828 -1809608 -1440818 -1550285
3835a550285K0177l25711Q13297j48029n92296m8163o1345K44017J038159j43436
$$ -1550285 -1530108 -1855819 -1042522 -1190551 -1782847 -1831010 -1892355 -1648338 -610179 -753615
3825g53615j782591J829457j039749O67631j036408M9474Q40049m68601n8840
$$ -753615 -2536206 -706749 -1746498 -1078867 -2115275 -2065801 -1225752 -1694353 -1753193
3816a753193O09169J00057j81741m5233r2494P03022n51732r22821K32341K68414
$$ -1753193 -1144024 -1043967 -1225708 -1270941 -1363435 -660413 -1212145 -2134966 -1902625 -1634211
3806a634211N19078r10301J22537j28746R62020Q5589Q157o89286K78269L26866
$$ -1634211 -1115133 -2025434 -1902897 -2031643 -1069623 -984034 -975877 -1665163 -1386894 -1060028
3796a060028n56543j37575M91005j041580M58304N94878p27946P13509m29759
$$ -1060028 -1616571 -1754146 -1263141 -2304721 -1846417 -1251539 -1979485 -1265976 -1695735
3787a695735M36805p75823P857Q66369K16967o90022K54964J64334K5069j44501
$$ -1695735 -1258930 -2034753 -2026896 -1160527 -943560 -1633582 -1378618 -1214284 -1189215 -1333716
3777a333716O37069o57390L21374k69411K8865O0741M47989q15929m31688R92478
$$ -1333716 -696647 -1354037 -1032663 -1302074 -1273209 -1212468 -764479 -1580408 -2012096 -1019618
3767a019618r0659j50245M87627k57811l61440N961N66847k54567K38749k17111
$$ -1019618 -1110277 -1260522 -772895 -1030706 -1392146 -1386185 -819338 -1073905 -835156 -1052267
3757a052267k75602l99008N84388j21101K00183m70351k67994P98070o66399N62516
$$ -1052267 -1327869 -1726877 -1142489 -1263590 -1063407 -1533758 -1801752 -1003682 -1670081 -1107565
3747a107565k17506N54181J39907n68207m20183O21719m29824n17791O41902J23024
$$ -1107565 -1325071 -770890 -630983 -1199190 -1619373 -997654 -1427478 -1945269 -1303367 -1180343
3737a180343l71253M60363O70426r07393N50156p38875L53759j13841j121712
$$ -1180343 -1551596 -1091233 -420807 -1328200 -778044 -1516919 -1163160 -1277001 -2398713
3728b398713J113357O00939r62835j94489N17994j15982L19933L41128m90128
$$ -2398713 -1285356 -684417 -1647252 -1841741 -1323747 -1439729 -1119796 -778668 -1268796
3719a268796r39533P76112k35020P90510j061829j31650J408785q86611O8715
$$ -1268796 -2208329 -1432217 -1667237 -876727 -1938556 -2070206 -661421 -1548032 -1479317
3710a479317N9508n79453O16987k09942K58290p53475K43999J50043m31958L33902
$$ -1479317 -1419809 -1999262 -1382275 -1592217 -1333927 -2087402 -1843403 -1693360 -2125318 -1791416
3700a791416N16700l02155O08944m34562l83654O80158K26830j89491l65272J68115
$$ -1791416 -1274716 -1576871 -967927 -1402489 -1786143 -1105985 -879155 -1068646 -1433918 -1265803
3690a265803L65728o60944K64664M3849L07474M1264m20754K44069n72436P60006
$$ -1265803 -900075 -1561019 -1296355 -1252506 -945032 -903768 -1324522 -1080453 -1652889 -892883
3680h92883K44177j287412Q20740r26817J346907q69986L57194N6919Q4231n21836
$$ -892883 -648706 -1936118 -1115378 -2042195 -695288 -1565274 -1208080 -1151161 -1066930 -1588766
3670a588766J37718J78756p6924r07970J268617p27086L44812k83949M63341m05380
$$ -1588766 -1451048 -1272292 -1349216 -2257186 -988569 -1715655 -1370843 -1654792 -1191451 -1596831
3660a596831J92746L80124q66301M12791m89881N55372m37031j61659k4088k8101
$$ -1596831 -1404085 -1023961 -1890262 -1477471 -1967352 -1411980 -1849011 -2010670 -2034758 -2062859
3650b062859K14416J176883n39764K01073k49925o62293Q99618l48690O8229p5151
$$ -2062859 -1848443 -671560 -1211324 -1010251 -1260176 -1922469 -1022851 -1371541 -1303312 -1378463
3640a378463j9015K98214j00872K808M87743p49045l8798k38128P91552p65299
$$ -1378463 -1397478 -1099264 -1200136 -1197328 -709585 -1458630 -1497428 -1735556 -944004 -1709303
3630a709303J423231j236399O16211L78531r81999L98891M53172k29292l46862
$$ -1709303 -286072 -1522471 -906260 -527729 -1509728 -1110837 -657665 -886957 -1233819
3621a233819R1632L53446n2388n11760r1938J15017j73408J195490k36996n03324
$$ -1233819 -1142187 -788741 -841129 -1352889 -1444827 -1329810 -1503218 -307728 -544724 -1048048
3611a048048N33501r55799l241L20549j89175j73535N14141n70261P80384l38541
$$ -1048048 -514547 -1470346 -1473587 -1153038 -1342213 -1515748 -1001607 -1571868 -791484 -1130025
3601a130025k07113j5152k06193l03071K35954m84536P52477j04345N27710r68175
$$ -1130025 -1337138 -1352290 -1558483 -1861554 -1625600 -2110136 -1357659 -1462004 -934294 -1902469
3591a902469O98676k93037k27321O96578M4310p82288J78912r72639J222042J85560
$$ -1902469 -1203793 -1496830 -1724151 -1027573 -983263 -1765551 -1586639 -2559278 -1337236 -1151676
3581a151676j89987p1929k69517R99466j293450Q6314Q90229l90503L11880l49884
$$ -1151676 -1341663 -1413592 -1683109 -683643 -1977093 -1890779 -1000550 -1391053 -1079173 -1429057
3571a429057l33503O22045L23092k47212J66588l31236n48257O50749m66766o6458
$$ -1429057 -1762560 -1140515 -817423 -1064635 -898047 -1229283 -1777540 -1126791 -1593557 -1660015
3561a660015Q52493Q3750n41462j15704O98817p21826L94000n10506Q09801K12736
$$ -1660015 -807522 -723772 -1265234 -1380938 -682121 -1403947 -1009947 -1520453 -710652 -497916
3551d97916p44991R48221p79976J48674j73955K1659k06506j9284O9072N96883
$$ -497916 -1242907 -294686 -1074662 -925988 -1099943 -1078284 -1284790 -1304074 -1235002 -638119
3541f38119K40300M36728j97293k41596l8995j23016l18200Q48083k07490N49675
$$ -638119 -397819 38909 -158384 -399980 -438975 -561991 -880191 -32108 -239598 310077
3531C10077J46076j122661N63341R8434o4224K82913j36197l20035k12180J81546
$$ 310077 456153 -666508 -103167 -4733 -68957 213956 77759 -242276 -454456 -272910
3521b72910R735J72039n97674J59879J94118j04951l87171K16673p5540m91602
$$ -272910 -263175 -91136 -688810 -528931 -334813 -439764 -826935 -610262 -685802 -1177404
3511a177404J497883j225108O05964j96047q83006J78150N33168J77652m76486
$$ -1177404 320479 -904629 -298665 -494712 -1377718 -1199568 -666400 -488748 -965234
3502i65234l20200k17899M67320O27953o84850J99989q72543Q48997J44227q54876
$$ -965234 -1285434 -1503333 -1036013 -408060 -1092910 -892921 -1765464 -916467 -772240 -1627116
3492a627116L98091k62428m1328K58388J112432o37615J64467j006580J420899
$$ -1627116 -1229025 -1491453 -1532781 -1274393 -161961 -799576 -635109 -1641689 -220790
3483b20790o21401m76734R14711k12803n90153M94360l0182o0017M87286k74243
$$ -220790 -842191 -1318925 -404214 -617017 -1207170 -712810 -742992 -803009 -315723 -589966
3473e89966o25042Q01033j27713m43564L30843L63439k88776L83548j311842J204979
$$ -589966 -1215008 -413975 -541688 -985252 -654409 -290970 -579746 -196198 -1508040 -303061
3463c03061R8668j38617n94422P6484L32079P511J158204l03385N26381k9918
$$ -303061 -204393 -343010 -937432 -860948 -528869 -521358 636846 333461 859842 829924
3453H29924l91591O80273j87270O2301P13393L62214N833j18503M9910K56665
$$ 829924 438333 1118606 931336 993637 1707030 2069244 2075077 1956574 2006484 2263149
3443B263149n46268k23724O88125m04272m07476M96144J6817j031628R83562r28546
$$ 2263149 1716881 1493157 2181282 1777010 1369534 1865678 1882495 850867 1834429 905883
3433I05883O48333l7290J040948q69249R2720N19512l21519J59725l55792j88474
$$ 905883 1554216 1516926 2557874 1688625 1781345 2300857 1979338 2139063 1783271 1594797
3423A594797j42884L27379j38388O73422q77967j186841L74566n86067K00537
$$ 1594797 1451913 1779292 1640904 2314326 1436359 249518 624084 38017 238554
3414B38554k93263Q9405O1386n5985l87978j99365l97069O43050k31371K90754
$$ 238554 -54709 34696 96082 40097 -347881 -547246 -944315 -301265 -532636 -241882
3404b41882l18685L0005o8275j78058M70281n2050J158L16968j98884N768l62915
$$ -241882 -560567 -530562 -598837 -776895 -306614 -358664 -357506 -40538 -239422 -233654 -596569
3393e96569J066586q97179L92671l39784R28599p70558J36227J109286L80075
$$ -596569 470017 -427162 -34491 -374275 554324 -216234 -80007 1029279 1409354
3384A409354q75764J46542l74393K88929M99594j043m51586M76101j519945Q29005
$$ 1409354 533590 680132 305739 594668 1094262 1093219 641633 1117734 -402211 426794
3374D26794q18642O65823k2863m469o76029K48764M7193k07922q01735M52084
$$ 426794 -391848 273975 251112 246643 -429386 -180622 -133429 -341351 -1143086 -691002
3364f91002L75529l36986k88453K37873j997j05342M58761r29846P22596L03491
$$ -691002 -315473 -652459 -940912 -703039 -705036 -810378 -351617 -1281463 -558867 -255376
$$ [...]
##END NTUPLES=NMR SPECTRUM
##END=
