##TITLE=abcd
##JCAMPDX= 6.0         $$ Bruker NMR JCAMP-DX V2.0
##DATA TYPE= NMR SPECTRUM
##DATA CLASS= NTUPLES
##ORIGIN= UXNMR, Bruker Analytische Messtechnik GmbH
##OWNER= root
$$ XWIN-NMR		Version 3.5
$$ Mon Dec  8 17:16:41 2025 Russian Standard Time (UT+4h)  servis@DPX200
##.OBSERVE FREQUENCY= 200.131235884673
##.OBSERVE NUCLEUS= ^1H
##.ACQUISITION MODE= SIMULTANEOUS
##.ACQUISITION SCHEME= undefined
##.AVERAGES= 32
##.DIGITISER RES= 18
##SPECTROMETER/DATA SYSTEM= spect
##.PULSE SEQUENCE= zg
##.SOLVENT NAME= CDCl3
##.SHIFT REFERENCE= (INTERNAL, CDCl3, 0, 16.4885)
##AUDIT TRAIL= $$ (NUMBER, WHEN, WHO, WHERE, WHAT)
$$ ##TITLE= Audit trail, XWIN-NMR		Version 3.5
$$ ##JCAMPDX= 5.01
$$ ##ORIGIN= Bruker BioSpin GmbH
$$ ##OWNER= servis
$$ F:\spectra/data/av/nmr/H1/1/pdata/1/auditp.txt
$$ ##AUDIT TRAIL=  $$ (NUMBER, WHEN, WHO, WHERE, WHAT)
(   1,<2025-12-08 17:15:56.84 +0400>,<servis>,<DPX200>,
      <created by zg, POWCHK disabled, PULCHK disabled
       configuration hash MD5:
       00 E9 B6 7A A2 85 ED C7 34 08 36 98 17 FE 4E 26
       data hash MD5: 32K
       FE 39 D0 8C F2 EB 30 17 97 D7 53 17 D7 22 52 C5>)
(   2,<2025-12-08 17:16:13.68 +0400>,<servis>,<DPX200>,
      <Start of raw data processing
       fp BC_mod = 2 FT_mod = 6 PKNL = 1 PHC0 = -263.8463 PHC1 = 6.301564 SI = 16K 
       data hash MD5: 16K
       12 07 99 AF D6 58 E1 4E 05 D5 4D B4 8B B2 F3 36>)
(   3,<2025-12-08 17:16:24.00 +0400>,<servis>,<DPX200>,
      <pk PHC0 = 2.2 PHC1 = 0 
       data hash MD5: 16K
       A3 0E 40 93 17 61 3F 63 72 E2 79 29 B7 CA 3C 1A>)
$$ ##END=
$$ 
$$ hash MD5
$$ 43 BC 03 3F 21 4C E1 61 07 95 0F 6E C4 06 CA 0C
##$RELAX= 
##$RELAX= 
##$RELAX= 
##$RELAX= 
##$RELAX= 
##$RELAX= 
##$RELAX= 
##$RELAX= 
$$ Bruker specific parameters
$$ --------------------------
##$DU= <F:\spectra>
##$EXPNO= 1
##$NAME= <H1>
##$PROCNO= 1
##$TYPE= <nmr>
##$USER= <av>
##$AMP= (0..31)
100 100 100 100 100 100 100 100 100 100 100 100 100 100 100 100 100 100 
100 100 100 100 100 100 100 100 100 100 100 100 100 100 
##$AQSEQ= 0
##$AQ_mod= 1
##$AUNM= <au_zg>
##$AUTOPOS= <>
##$BF1= 200.13
##$BF2= 200.13
##$BF3= 200.13
##$BF4= 200.13
##$BF5= 500.13
##$BF6= 500.13
##$BF7= 500.13
##$BF8= 500.13
##$BYTORDA= 1
##$CFDGTYP= 0
##$CFRGTYP= 5
##$CHEMSTR= <none>
##$CNST= (0..31)
1 1 145 1 1 1 1 1 1 1 1 1 1 1 1 1 1 1 1 1 1 1 1 1 1 1 1 1 1 1 1 1 
##$CPDPRG= <>
##$CPDPRG1= <>
##$CPDPRG2= <>
##$CPDPRG3= <>
##$CPDPRG4= <mlev>
##$CPDPRG5= <mlev>
##$CPDPRG6= <mlev>
##$CPDPRG7= <mlev>
##$CPDPRG8= <mlev>
##$CPDPRGB= <>
##$CPDPRGT= <>
##$D= (0..31)
0 2 0 0 0 0 0 0 0 0.06 0 0 0 0 0 0 0.0002 0 0 0 0 0 0 0 0 0 0 0 0 0 0 
0 
##$DATE= 1765199756
##$DBL= (0..7)
120 120 120 120 120 120 120 120 
##$DBP= (0..7)
150 150 150 150 150 150 150 150 
##$DBP07= 0
##$DBPNAM0= <>
##$DBPNAM1= <>
##$DBPNAM2= <>
##$DBPNAM3= <>
##$DBPNAM4= <>
##$DBPNAM5= <>
##$DBPNAM6= <>
##$DBPNAM7= <>
##$DBPOAL= (0..7)
0.5 0.5 0.5 0.5 0.5 0.5 0.5 0.5 
##$DBPOFFS= (0..7)
0 0 0 0 0 0 0 0 
##$DE= 6
##$DECBNUC= <off>
##$DECIM= 32
$$ [...]
##$SUBNAM4= <"">
##$SUBNAM5= <"">
##$SUBNAM6= <"">
##$SUBNAM7= <"">
##$SUBNAM8= <"">
##$SUBNAM9= <"">
##$SW= 20.6817932712277
##$SWIBOX= (0..15)
0 0 3 0 0 0 0 0 0 0 0 0 0 0 0 0 
##$SW_h= 4139.07284768212
##$TD= 32768
##$TD0= 1
##$TE= 0
##$TE2= 300
##$TE3= 300
##$TEG= 300
##$TL= (0..7)
0 120 120 120 120 120 120 120 
##$TP= (0..7)
150 150 150 150 150 150 150 150 
##$TP07= 0
##$TPNAME0= <>
##$TPNAME1= <>
##$TPNAME2= <>
##$TPNAME3= <>
##$TPNAME4= <>
##$TPNAME5= <>
##$TPNAME6= <>
##$TPNAME7= <>
##$TPOAL= (0..7)
0.5 0.5 0.5 0.5 0.5 0.5 0.5 0.5 
##$TPOFFS= (0..7)
0 0 0 0 0 0 0 0 
##$TUNHIN= 0
##$TUNHOUT= 0
##$TUNXOUT= 0
##$USERA1= <user>
##$USERA2= <user>
##$USERA3= <user>
##$USERA4= <user>
##$USERA5= <user>
##$V9= 5
##$VALIST= <valist>
##$VCLIST= <CCCCCCCCCCCCCCC>
##$VD= 0
##$VDLIST= <DDDDDDDDDDDDDDD>
##$VPLIST= <PPPPPPPPPPPPPPP>
##$VTLIST= <TTTTTTTTTTTTTTT>
##$WBST= 1024
##$WBSW= 30
##$XGAIN= (0..3)
0 0 0 0 
##$XL= 0
##$YL= 0
##$YMAX_a= 504610
##$YMIN_a= -293073
##$ZGOPTNS= <>
##$ZL1= 120
##$ZL2= 120
##$ZL3= 120
##$ZL4= 120
##$ABSF1= 0
##$ABSF2= 0
##$ABSG= 0
##$ABSL= 0
##$ALPHA= 0
##$AQORDER= 0
##$ASSFAC= 0
##$ASSFACI= 0
##$ASSFACX= 0
##$ASSWID= 0
##$AUNMP= <proc_1d>
##$AZFE= 0.1
##$AZFW= 0.1
##$BCFW= 0
##$BC_mod= 2
##$BYTORDP= 0
##$COROFFS= 0
##$CY= 18.4799938201904
##$DATMOD= 1
##$DC= 0
##$DFILT= <>
##$DTYPP= 0
##$F1P= 9.9274215381318
##$F2P= -0.165520771350173
##$FCOR= 1
##$FTSIZE= 16384
##$FT_mod= 6
##$GAMMA= 0
##$GB= 0
##$INTBC= 1
##$INTSCL= 4.127829e-11
##$ISEN= 128
##$LB= 0
##$LEV0= 0
##$LPBIN= 0
##$MAXI= 10000
##$MC2= 0
##$MEAN= 0
##$ME_mod= 0
##$MI= 50
##$NCOEF= 0
##$NC_proc= -7
##$NLEV= 6
##$NOISF1= 3.799351
##$NOISF2= 2.8
##$NSP= 0
##$NTH_PI= 0
##$NZP= 0
##$OFFSET= 16.48848
##$PC= 4
##$PHC0= -261.6463
##$PHC1= 6.301564
##$PH_mod= 1
##$PKNL= yes
##$PPARMOD= 0
##$PSCAL= 4
##$PSIGN= 0
##$REVERSE= no
##$SF= 200.130005582386
##$SI= 16384
##$SIGF1= 3
##$SIGF2= 2
##$SINO= 400
##$SIOLD= 16384
##$SREGLST= <1H.CDCl3>
##$SSB= 0
##$STSI= 16384
##$STSR= 0
##$SW_p= 4139.07284768211
##$SYMM= 0
##$S_DEV= 0
##$TDeff= 32768
##$TDoff= 0
##$TI= <>
##$TILT= no
##$TM1= 0
##$TM2= 0
##$TOPLEV= 0
##$USERP1= <user>
##$USERP2= <user>
##$USERP3= <user>
##$USERP4= <user>
##$USERP5= <user>
##$WDW= 0
##$XDIM= 16384
##$YMAX_p= 381076981
##$YMIN_p= -1898898
$$ End of Bruker specific parameters
$$ ---------------------------------
##NTUPLES= NMR SPECTRUM
##VAR_NAME=  FREQUENCY,     SPECTRUM/REAL,   SPECTRUM/IMAG
##SYMBOL=    X,             R,               I
##VAR_TYPE=  INDEPENDENT,   DEPENDENT,       DEPENDENT
##VAR_FORM=  AFFN,          ASDF,            ASDF
##VAR_DIM=   16384,         16384,           16384
##UNITS=     HZ,            ARBITRARY UNITS, ARBITRARY UNITS
##FACTOR=    0.252644378177508, 1,           1
##FIRST=     3299.83951724647, 0,            0
##LAST=      -839.233330435636, 0,           0
##MIN=       -839.233330435636, -1898898,    0
##MAX=       3299.83951724647, 381076981,    0
$$ Real data points
##PAGE= N=1
##DATA TABLE= (X++(R..R)), XYDATA
$$ [...]
9255I93890J79571m17805k12409J71156K45775k47939j59592j35215K63441j11179
9245E69694K58897l51857k38357O34858k44962p0709L32457k37627q3167L21130
9235H90357m05336L41656R7291j01011l79698P9115j58235N4572P92316r5867
9225A115160l73899l67457M37860n0433J44102L6640J33430q2034l15866q4157
9215E93346K22696K264q1377k0925N09765n09865J67702m06535P56343m34970
9205G98444m9894L57312r1941k07957K53240o91102L53131l59869Q66254j92937
9195A034681j84540O0437J49852l92290R2827J69891K21701j76563j732n41964
9185D32300Q57879q13946J41474J38338J23293M27997k66066P8404l3037r2671
$$ plain form
9255 993890 1173461 755656 543247 714403 960178 712239 552647 417432 680873 569694
9245 569694 828591 476734 238377 873235 628273 557564 890021 652394 569227 890357
9235 890357 485021 826677 923968 822957 443259 522374 364139 418711 1211027 1115160
9225 1115160 741261 373804 811664 761231 905333 941973 1075403 993369 677503 593346
9215 593346 816042 818306 736929 716004 1225769 715904 883606 477071 1233414 798444
9205 798444 748550 1105862 1013921 805964 1059204 368102 721233 361364 1227618 1034681
9195 1034681 850141 910578 1060430 668140 760967 930858 1152559 975996 974264 432300
9185 432300 1290179 476233 617707 756045 879338 1307335 1041269 1119673 1086636 993965
9175I93965K82308o3149K01962n24416J04882L62844k98878P379q3461O5209Q59282
9164A907927k41141P0067K19621k51344k87228p2888J04217J74687J6732r0301
9154A550349j32167L90035l56775J93327L60354l00346l3660j40951M99462q6122
9144A943506j23947k29667J21210L03075j35379j29740L37311M5672j60128k9126
9134A942787L10939K79835j46945r0220K46305l99794N76165n27286P82861q11270
9124B163377J09962J152142j16976m37215M87449k67972L17008K82580j27106
9115C563249L37666q0366J91633M88960N15065N08083J12598J13914j14561M53123
9105F089364J116263K42487k16779J367760N87777M76948J003883R39525J407614
$$ plain form
9175 993965 1276273 1213124 1415086 890670 995552 1358396 1059518 1066897 983436 1048645 1907927
9164 1907927 1666786 1736853 1956474 1705130 1417902 1345014 1449231 1623918 1640650 1550349
9154 1550349 1418182 1808217 1451442 1644769 2005123 1704777 1671117 1530166 2029628 1943506
9144 1943506 1819559 1589892 1711102 2014177 1878798 1749058 2086369 2132041 1971913 1942787
9134 1942787 2253726 2533561 2386616 2296396 2542701 2142907 2719072 2191786 2974647 2163377
9124 2163377 2273339 3425481 3308505 2871290 3358739 3090767 3407775 3690355 3563249
9115 3563249 3900915 3820549 4012182 4501142 5016207 5524290 5636888 5750802 5636241 6089364
9105 6089364 7205627 7448114 7231335 8599095 9186872 9663820 10667703 11607228 13014842
9096A3014842J581722J247186K818812K858386M530155M387669P050641Q735793
9088D6225206R791542P676573K591905k877042p521975p527675p871957n968297
9080C4518280n177846m677155m142531k626450k685063k249275j848232j389622
9072I722106q94676j231604p18038j58173m70647l79744m56600r96330j48140
9063D268154j18681L32420p99593N56392p97069k24257Q17824j227296O46784
9054C454678k93463o69824K23257j33129K39503N9921k19313l70455k23286K76081
9044B343970J97338m52026J20363M29312j52080j73442j80027j33503p9226o63144
9034A257535k27232N52177N3395m24097L31899r5184Q3171J80112j4744N2930
$$ plain form
9096 13014842 14596564 15843750 18662562 21520948 26051103 30438772 37489413 46225206
9088 46225206 56016748 63693321 66285226 63408184 55886209 48358534 40486577 34518280
9080 34518280 29340434 24663279 20520748 17894298 15209235 12959960 11111728 9722106
9072 9722106 8827430 7595826 6877788 6719615 6248968 5869224 5412624 4416294 4268154
9063 4268154 4149473 4481893 3682300 4238692 3441623 3217366 4035190 2807894 3454678
9054 3454678 3161215 2491391 2714648 2581519 2821022 2880943 2661630 2291175 2067889 2343970
9044 2343970 2541308 2089282 2209645 2638957 2486877 2313435 2133408 1999905 1920679 1257535
9034 1257535 1030303 1582480 1635875 1211778 1543677 1448493 1531664 1711776 1697032 1749962
9024A749962j08344J43235o10526K69154k07797j54918k40947M05725K95839r70414
9014E70969R38440k90208q1411k14135k12918M3217j18888M42764n60312L27065
9004H44583J8569N73200k09692p52105M16921R3888L2572L28094n94355j62495
8994E89180L43913l06526P20811n1104p23016j3812n33092O60422r1528k14021
8984C81227P9213L91128j53609J76995l06503K16446k393k3842l45898L24568
8974G37332k8756k13164K42684o5434k33840N81720l58740J53209n4689q2650
8964F77672J52563K73748m49360l02474q4590M1637p7934L1748N65430J83482
8954A011922j98566l46814j26801K50208Q9832m0114l65449M39200L51780o26299
$$ plain form
9024 1749962 1641618 1784853 1174327 1443481 1235684 1080766 839819 1245544 1541383 570969
9014 570969 1509409 1219201 1137790 923655 710737 753954 635066 1077830 517518 844583
9004 844583 863152 1436352 1226660 474555 891476 985364 1017936 1346030 751675 589180
8994 589180 933093 626567 1347378 1296274 573258 559446 26354 686776 595248 381227
8984 381227 460440 851568 697959 874954 568451 784897 782504 758662 412764 737332
8974 737332 708576 495412 738096 672662 438822 1020542 661802 815011 760322 677672
8964 677672 830235 1103983 654623 352149 267559 309196 231262 263010 828440 1011922
8954 1011922 813356 466542 339741 589949 679781 639667 274218 713418 1065198 438899
8944D38899o5502K48687r3368Q4437j42050K42948j79775m10422j61876L94452
8934C56430K09175n64377J62125J83576M0438l1170L57871m68266M08742l98032
8924B56512j75174K35230K08784J10256m9729K8446j50970J61404m51624J64647
8914C37782J97165n58407P57547J5280j140380J014867m28648k46419L89588L98916
8904G37291l04454l83557J40822k32308L91821j05644J14982M05635p41641L00357
8894C23304P1670j41562J14654k78294J82115j51704q2637J44187N06735j78853
8884E09615K6788P4557l06213k08588Q69307j64174l70266j92809L25319J58989
8874G22525l00637k55466K68308j69059n1452L32604M56161l12019n53041M26301
$$ plain form
8944 438899 373397 622084 528716 613153 471103 714051 534276 123854 -38022 356430
8934 356430 565605 1228 163353 346929 387367 356197 714068 245802 654544 256512
8924 256512 81338 316568 525352 635608 585879 614325 463355 624759 173135 337782
8914 337782 534947 -23460 734087 749367 -391013 623854 195206 -51213 338375 737291
8904 737291 432837 49280 190102 -42206 349615 243971 358953 764588 22947 323304
8894 323304 394974 253412 368066 89772 271887 120183 37546 181733 688468 509615
8884 509615 536403 610960 304747 96159 965466 801292 431026 238217 563536 722525
8874 722525 421888 166422 434730 265671 214219 546823 1002984 690965 137924 564225
8864E64225k4017o71580O37565l69936L6827J20889k6538j00163M01774J35475
8854G04521l60126J01920j87903L7669J64984J09237m77154K04626p5721L13883
8844E35936k43328m77181P30763l23127L0271n909L4446k76352L08178m7190P0978
8833C37485m6498L14916J63181q66642M20184L57918j70559p14410O25943N57279
8823I78797r11406J88178L54642k4736p14133N14710p2946l4624L50332J90563
8813H19377l50188m19593L43388k21403J6962l7481J41381K86735l00188l6737
8803B42253L56840K1777j64670k71965m952J38094k44348N71885l06343J06009
8793D44580k0642Q6071j97043k35392L25727K59087p6719n21341K26814n17657
$$ plain form
8864 564225 540208 -131372 506193 136257 173084 293973 267435 167272 569046 704521
8854 704521 344395 446315 258412 296081 461065 570302 93148 297774 222053 535936
8844 535936 292608 -184573 546190 223063 253334 247425 281871 5519 313697 266507 337485
8833 337485 290987 605903 769084 -97558 322626 680544 509985 -204425 421518 978797
8823 978797 67391 255569 610211 585475 -128658 386052 313106 278482 628814 819377
8813 819377 469189 49596 392984 171581 188543 151062 292443 579178 278990 242253
8803 242253 599093 620870 456200 184235 179283 317377 73029 644914 338571 444580
8793 444580 423938 510009 312966 77574 403301 662388 585669 64328 291142 -226515
8783b26515N86574l09431k66851K95659K20043N59690o56741M24620k84162K3269
8773C66155L4027P6871l21571L12298J71737K2386L13170k10204l81266K07679
8763E91282k33704J62607l53786K56466K32543l33322K22340k78007M09363k35928
8753D39854P7668o2575j76941l76026L42913n0059M34405k30860j48122l1661
8743B18596P6243J08311j99525K3672J83777j37651L27903r9966L90044m54513
8733D36891J93715J21941o13051K54599J5275l14950M77128k20154K54369K33969
8723H39732m38837o7577L82066n1561l70974L61113l15245j58447L29242K57110
8713G66622L1226L3330r20927L48547k4385N02352k49487m7755m89739N68980
$$ plain form
8783 -226515 360059 50628 -216223 79436 299479 859169 202428 627048 342886 366155
8773 366155 400182 477053 155482 467780 639517 661903 975073 764869 383603 591282
8763 591282 357578 520185 166399 422865 655408 322086 544426 266419 675782 439854
8753 439854 517522 454947 278006 -98020 244893 194834 629239 398379 250257 218596
8743 218596 294839 403150 203625 227297 411074 273423 601326 501360 891404 436891
8733 436891 630606 752547 139496 394095 409370 94420 571548 351394 605763 839732
8723 839732 400895 333318 715384 663823 292849 653962 338717 180270 509512 766622
8713 766622 797848 831178 -89749 258798 234413 736765 487278 439523 -50216 518764
8703E18764l96572j26222N37152n51219K73340N84140l0649o56515O56517m60807
8693C47929J83037j17167R1325p5557j8163J41088l70022K13825Q177K43398J0703
8682F58573j14337k78930Q24165m27052Q7386l35576J82350j73850n3449n9671
8672C09609O65826J88339j44097m2627q9309k03733L59030M497j28492O1489l47844
8661F32688k43477J58124j57161R697J76730m77532K79947J91816M40889q51901
8651A59820K4375J32227J99458J26930q830l28568K74346k04149J43068l83208
8641A35469J35169n231R41462o01504k00251n01M8239J9875M54267k39803j13584
8630E73607j46148J3792k11752J16626k39234R8315j05305M16231o85117N57614
$$ plain form
8703 518764 122192 -4030 533122 -18097 255243 839383 808734 152219 808736 347929
8693 347929 530966 413799 505124 429567 411404 552492 182470 396295 404472 647870 658573
8682 658573 544236 265306 1089471 662419 749805 414229 596579 422729 369280 309609
8672 309609 975435 1163774 1019677 977050 887741 684008 1043038 1047535 919043 980532 632688
8661 632688 389211 547335 390174 399871 576601 99069 379016 570832 1011721 159820
8651 159820 184195 316422 515880 642810 633980 305412 579758 375609 518677 135469
8641 135469 270638 265407 1206869 605365 405114 404613 452852 472727 926994 687191 573607
8630 573607 427459 441251 229499 346125 106891 205206 99901 516132 -168985 388629
8620C88629j46150P60719p04840J79161M1401K36316m76168r0162K79400l3549
8610D34757j88571N28537k76197j73768L09664m45129M12938j29726Q26031j151274
8600A47262k3086K48845K01222l56776M71296m82633N11712m59572M88149l94606
8590C51813k29543L93225l3990l41608R8687K59592K42718r5100m83417K78401
8580D40778K65102j07002k12382R5272J7892J30586J97872j88393J34656l39772
8570D34609M20712m44606M49413j44808k90954j59310J05940K81244J11648m75090
8560B88798j39934O15422k10769j6076m13584N29123j78427J22414l0377o29854
8550f3264K5859Q54669k68119K97729n28304J25761J77896p3556m4799q57202
$$ plain form
8620 388629 242479 1003198 298358 477519 518920 755236 279068 188906 468306 434757
8610 434757 246186 774723 498526 324758 634422 189293 602231 472505 1298536 147262
8600 147262 124176 373021 574243 217467 688763 206130 717842 258270 746419 351813
8590 351813 122270 515495 481505 139897 238584 498176 740894 645794 162377 440778
8580 440778 705880 598878 386496 481768 499660 630246 828118 639725 774381 434609
8570 434609 855321 410715 860128 715320 424366 265056 370996 652240 763888 288798
8560 288798 148864 764286 553517 537441 123857 652980 474553 596967 566590 -63264
8550 -63264 -37405 817264 549145 846874 318570 444331 622227 548671 503872 -353330
8540c53330O78036L81221M1839l16114m24710M58709l58376J29534J82482l82651
8530C6640j792j440012L790445j215561j41753l04713L37787k08362L69366l69063
8520H52982K94751J98700l51565Q3137l99836R4919k84339L40414n0710j51955
8510F26498L91419m99852k91410M01156j37158J66152k91373m0132L93731l21288
8500C97743K72117k34302J11111J80494m92357K31248M45941k57429n70493L81975
8490D66048o5126j93425K75594K9402M57466q16371M91284j4497J54092n7174
8480G27293K79858j68645n81045M41800k34622L99411P877J0433p47695N55335
8470F90000m54672L95157k77679N2762K86672J65405j02694k94575j52878K43409
$$ plain form
8540 -353330 324706 705927 747766 431652 6942 465651 107275 236809 419291 36640
8530 36640 34848 -1405164 2385281 1169720 1027967 723254 1061041 852679 1222045 852982
8520 852982 1147733 1346433 994868 1078005 678169 773088 488749 829163 778453 626498
8510 626498 1017917 518065 226655 627811 490653 656805 365432 325300 719031 397743
8500 397743 669860 435558 546669 727163 234806 466054 911995 654566 84073 466048
8490 466048 400922 207497 483091 512493 969959 153588 644872 630375 784467 727293
8480 727293 1007151 838506 257461 699261 464639 864050 871927 882360 134665 690000
8470 690000 235328 630485 352806 405568 692240 857645 754951 460376 307498 550907
8460E50907K09409j30035M81647l9813j96755j36322J77941r8454k1138k15904
8450E81483o68534M57189N57333l11749j29511N63660m04714K71947j52180m88600
8440B76324K57316J69812j26723R6944J01491m45479K07029q982O1284K58224
8430H47240m32878M37564m00673J92616n429J96429p6250J139j95529J13104o163
8419F71170Q2230L67050K17413l12174o21658Q3962J47919K00805j72521n60023
8409A04173M21932L22896n0550J98245n12300K36099q0041K89880j07717n11708
8399C10909O77134m29282L3791j7309L34819k5j94349J87655j77547Q24199o98680
8388H51315r8786r409J93284k89552J09482j1019K11721k6679L7149p4656k4435
$$ plain form
8460 550907 760316 630281 1111928 1072115 875360 739038 916979 818525 797387 581483
8450 581483 -87051 370138 927471 615722 486211 1049871 645157 917104 764924 276324
8440 276324 533640 703452 576729 673673 775164 329685 536714 527732 589016 847240
8430 847240 414362 851926 451253 643869 638440 834869 758619 759758 564229 677333 671170
8419 671170 753400 1120450 1337863 1025689 404031 487993 635912 836717 664196 104173
8409 104173 526105 849001 798451 996696 484396 720495 640454 930334 822617 310909
8399 310909 988043 558761 592552 575243 910062 910037 715688 903343 725796 1549995 851315
8388 851315 752529 743120 936404 646852 756334 745315 957036 930357 967506 892850 868415
8377H68415k29436r3628O26800k48439L13417n66182K12495K6176o19285M11291
8367G01624n657J74185K22947p7770m13432k2197L65064l91799O81156n75630
8357F58491L5830P27719r61052N49986K06766n65972Q3642K84649N0538l26346
8347G44251P7625J33759M28k03176J22323j89512q9145J43539M92585j89782k74749
8336G68146J218K24852k23839J11086r8072L21223O8408j09722k4823j14177N7088
8325I81388l67972N90694k33061M68926p7813k24909R2449l9712L6341j52263
8315A074068J21253N846K8787K40923o54507J61682J3261J28389O6700l97655
8305G88747p9875M34329J66764n40041J84998M98005k94035l52186P98868m22219
$$ plain form
8377 868415 638979 545351 1172151 923712 1237129 670947 883442 909618 290333 701624
8367 701624 695967 870152 1093099 1015329 601897 579700 944764 552965 1234121 658491
8357 658491 694321 1422040 460988 1010974 1217740 651768 735410 1020059 1070597 744251
8347 744251 821876 955635 956063 752887 875210 685698 596553 740092 1232677 1042895 768146
8336 768146 769364 994216 770377 881463 783391 1104614 1173022 1063300 1038477 924300 981388
8325 981388 613416 1204110 971049 1439975 1362162 1137253 1229702 1189990 1226331 1074068
8315 1074068 1195321 1201167 1229954 1470877 816370 978052 991313 1119702 1186402 788747
8305 788747 708872 1143201 1309965 769924 954922 1452927 1158892 806706 1605574 1183355
8295A183355K06617o14893O51562o79867M81488k56225K42615l74601N36419j55966
8285A220504n88381M03634K05665j01897R2288o563k96837O1096n9536M9925L0329
8274A010227o10750M73946L32329j68953k42818L92404k47933K38889l04757m0431
8264H32153j45760N93849k72890L8946P2003m95557O10547J80312n32663O1627
8254I42567L87106j88197l62569O41843j34055m7114j12244K07966n5796K10428
8244A489935n95933L83287J19238j02282k04609K88213K85279j12772k61807K8494
8234A317043k85875P02898l92055Q37026o95458K80766l80589J27832m04559Q52590
8224A959619n00207r33777N27473N93781l8744l88929P9910L29770L84483k00974
$$ plain form
8295 1183355 1389972 775079 1426641 746774 1228262 972037 1214652 840051 1376470 1220504
8285 1220504 632123 1035757 1241422 1139525 1231813 1225250 928413 989509 929973 979898 1010227
8274 1010227 399477 873423 1205752 1036799 793981 1186385 938452 1177341 872584 832153
8264 832153 686393 1280242 1007352 1046298 1118301 622744 1233291 1413603 880940 942567
8254 942567 1329673 1141476 778907 1420750 1286695 1239581 1127337 1335303 1279507 1489935
8244 1489935 894002 1277289 1396527 1294245 1089636 1377849 1663128 1550356 1288549 1317043
8234 1317043 1031168 1734066 1342011 2179037 1483579 1764345 1383756 1511588 1107029 1959619
8224 1959619 1459412 525635 1053108 1646889 1608145 1219216 1299126 1628896 2013379 1812405
8214A812405J56416l11019J33877j58373r633l21163Q48858r72002M89664l93952
8204A275078K90453K38335m36245L22374n63017l69985O72438k07676o1915k32549
8194I27291L82604K64378L143230k872592o33007O96622l67036j11598j57123
8185A272769K31457l88152Q63418l58099L62889J97393l53101J96725l49231L52082
8175B028150m62882j49939O14955j68360J19619k61235M81268l78455j942m13360
8165A407819K33949j31379Q8841P03751l45290n05134L93738r9268L46015o906
8155B086136K14958m70162N34731q20977M48647l02384J52347J41552k50935O02254
8145B336167n06025P0332m1508L2943k68081p0321k11075N79027m88381Q7402
$$ plain form
8214 1812405 1968821 1657802 1791679 1633306 1623673 1302510 2151368 1179366 1669030 1275078
8204 1275078 1565531 1803866 1367621 1689995 1126978 756993 1429431 1221755 1159840 927291
8194 927291 1309895 1574273 4717503 1844911 1211904 1908526 1541490 1429892 1272769
8185 1272769 1504226 1116074 1979492 1621393 1984282 2181675 1828574 2025299 1676068 2028150
8175 2028150 1565268 1415329 2030284 1861924 1981543 1720308 2201576 1823121 1821179 1407819
8165 1407819 1641768 1510389 1599230 2302981 1957691 1452557 1846295 1747027 2093042 2086136
8155 2086136 2301094 1830932 2365663 1544686 1993333 1690949 1843296 1984848 1733913 2336167
8145 2336167 1830142 1900474 1858966 1891909 1623828 1553507 1342432 1921459 1433078 1520480
8135A520480N60047j32023j99245L14680N525j34165j32049j43222l19299P02722
8125B043451o21142N43303n8138j87882j45886Q4225M65574Q0513p61354M68167
8115A910831K84032R6851j04182m09271J11797J05224k54187n01089N92930j87294
8105A645642N62166n42049O39579l35623o207j20124l73449R35994n00004l14408
8095A591517N9972n897N63778j86320J67491m44200M16422l88365M21275n42281
8085A653392O74845L1826o47764K5211M49642k92128p6417L42583J18355k10540
8075B069005l07197M06024J3132m81583L02713p0082O50675k07867q5403k42329
8065B047088K69970m50325M91690J8788J51646j48515K25218m40905J242K29814
$$ plain form
8135 1520480 2080527 1948504 1749259 2063939 2069464 1935299 1803250 1660028 1340729 2043451
8125 2043451 1422309 1965612 1907474 1719592 1573706 1657931 2123505 2204018 1442664 1910831
8115 1910831 2194863 2291714 2187532 1778261 1890058 1995282 1741095 1240006 1832936 1645642
8105 1645642 2207808 1665759 2305338 1969715 1963508 1843384 1469935 2405929 1905925 1591517
8095 1591517 1651489 1645592 2209370 2023050 2190541 1746341 2162763 1774398 2195673 1653392
8085 1653392 2328237 2360063 1712299 1737510 2187152 1895024 1818607 2161190 2279545 2069005
8075 2069005 1761808 2167832 2180964 1699381 2002094 1932012 2582687 2374820 2289417 2047088
8065 2047088 2317058 1866733 2358423 2377211 2528857 2380342 2605560 2164655 2165897 2395711
8055B395711r7369l08455R12770m63666m17250L75548J27943J36336l08172N99853
8045B953249k84372J56209K33841k04825J91313j6538O3585j9030k70711N41500
8035C344221n87266L78885m59265K43785K28826l36345M33874l51089O11717q27412
8025B679931O24437j66593O7716m5162J74234k14281K55038k34503K44634k28165
8015C157286Q0717O54050m58117J04766j466M77055n0571m56480J88174M16278
8005D111692l02138K05626j11302J38661K06250k39006j60847L12216O17767k35629
7995D543290l30388J350P84801n13352N46734l42005o6114M60780l55338j20875
7985D608883N68475n00931L45744N27378m13238K66432N2351j94523O07349J1164
$$ plain form
8055 2395711 2298342 1989887 2902657 2438991 2021741 2397289 2525232 2661568 2353396 2953249
8045 2953249 2668877 2825086 3058927 2854102 3045415 3028877 3092462 3073432 2802721 3344221
8035 3344221 2756955 3135840 2676575 2920360 3149186 2812841 3246715 2895626 3507343 2679931
8025 2679931 3304368 3137775 3205491 3160329 3334563 3120282 3375320 3140817 3385451 3157286
8015 3157286 3238003 3892053 3433936 3538702 3537236 4014291 3963720 3507240 3695414 4111692
8005 4111692 3809554 4015180 3903878 4042539 4248789 4009783 3848936 4161152 4778919 4543290
7995 4543290 4212902 4214252 4999053 4485701 5032435 4690430 4624316 5085096 4729758 4608883
7985 4608883 5177358 4676427 5022171 5549549 5136311 5402743 5455094 5260571 5867920 5879084
7975E879084L49962K29038m41972k07285K75498N2688K09597J20323m34909K64158
7965F296182P27093o9385j95975L91725l476K50581j13733L21071o05957P53450
7955G751576J73056j72653N79567Q6627M24200q89542M31780j64559j35832O07602
7945H691822k4796K05206M1874M95655l78838q772L36000J68762O41005l24558
7935I843360L27500k03400M70484j058Q8282L88665Q8928K74007L41532O11510
7925A2229810k29636k92850N67221N11180J84043N84190j06594N23709J120614
7916A5091687m21067O70187L92163L36935J099654m6598Q55076R02402Q60425
7907A9740864J273989J356502N54609J238084O27211J458145J414496J523239
$$ plain form
7975 5879084 6229046 6458084 6016112 5808827 6084325 6137013 6346610 6466933 6032024 6296182
7965 6296182 7023275 6953890 6757915 7149640 7146164 7396745 7283012 7604083 6998126 7751576
7955 7751576 7924632 7751979 8331546 8418173 8842373 7952831 8384611 8220052 8084220 8691822
7945 8691822 8667026 8872232 8914106 9409761 9030923 9022151 9358151 9526913 10167918 9843360
7935 9843360 10170860 9967460 10437944 10436886 10525168 10913833 11002761 11276768 11618300 12229810
7925 12229810 12000174 11707324 12274545 12785725 12969768 13553958 13447364 13971073 15091687
7916 15091687 14670620 15340807 15732970 16069905 17169559 17122961 17978037 18880439 19740864
7907 19740864 21014853 22371355 22925964 24164048 24791259 26249404 27663900 29187139
7899B9187139N87752J799005J423126J716295K251610K444850L206030L092195
7891D5708002M232522N093300O641488P042812Q346408P756024P017528N842921
7883I7681005M913610N258342M066032L985345K088968M13607k273037m782067
7875A11351805o432065o892687n858057m501153l930316j986980p84373j63997
7867H0802177K217260L433445M584605N684902N445237L301975R79117L37827
7859A06786545j15925Q752J220037J277113k684001r18675l609076o090408p207978
7850H8666384o692130o415309n752521m417736m266758k970875k436725j886970
7842E3827360j372645r69717O5640J57789P87775J884459K845926L029135M171056
$$ plain form
7899 29187139 29774891 31573896 32997022 34713317 36964927 39409777 42615807 45708002
7891 45708002 49940524 55033824 61675312 68718124 77064532 84820556 91838084 97681005
7883 97681005 102594615 107852957 111918989 115904334 117993302 118406909 116133872 111351805
7875 111351805 104919740 98027053 92168996 87667843 83737527 81750547 80966174 80802177
7867 80802177 83019437 86452882 91037487 96722389 102167626 105469601 106448718 106786545
7859 106786545 106670620 106679372 107899409 109176522 106492521 105573846 101964770 95874362 88666384
7850 88666384 81974254 75558945 69806424 65388688 61121930 58151055 55714330 53827360
7842 53827360 52454715 51484998 51550638 51708427 52496202 54380661 57226587 60255722 64426778
7833F4426778N058216P393170N647418N237582M503911K544914L074975J341346
7825I9228310K451458K459488J529291j415610l553370m872529n711414o116411
7817H3999213m865202l004825l420629q27064N11112K130590L188322L787688
7809H1499205L605777M038587K617339J063279J161279Q81076J86990K74578L44982
7800I5673092j400365l312613n361509o342431p818487o358650p168622n020130
7792E2890285m847746m117882l096540k607013k087076k044650j523299j131083
7784C1434996r08389j294931n22870j119652q45481j31493n91386l16885m94313
7775B5209596K66990l95558n38014q3579K62243l02521M91341L25818l63997L70210
$$ plain form
7833 64426778 69484994 76878164 82525582 87763164 92267075 94811989 97886964 99228310
7825 99228310 101679768 104139256 105668547 104252937 100699567 95827038 90115624 83999213
7817 83999213 79134011 76129186 72708557 71881493 72392605 74523195 77711517 81499205
7809 81499205 85104982 89143569 91760908 92824187 93985466 94866542 95053532 95328110 95673092
7800 95673092 94272727 90960114 85598605 79256174 71437687 65079037 57910415 52890285
7792 52890285 48042539 43924657 40828117 38221104 36134028 34089378 32566079 31434996
7784 31434996 30526607 29231676 28708806 27589154 26743673 26612180 26020794 25703909 25209596
7775 25209596 25476586 25081028 24543014 24459435 24721678 24419157 24910498 25236316 24872319 25242529
7765B5242529l61146k12344J56785k32525O8047j22166j163896q67460p20329
7756B1787495j323899l70122r41657j039767m68880j21746K29404P37959J07638
7747A8596425L66294K1984k86805r5998m38733N07675q16688K83549j30310j79558
7737A7827835j67818r14135p52274k73765j185127j013525q45630m66863r55684
7728A1253014j65014m81277l83057l09214k83585N3486n10349j05393J10473l60065
7718H819019K70600o77181k00407L94840n00446k4383j05829o19581N31232q3091
7708G804773m63788N8530j70102o3611J3318r2225r27415k16024K11877j36717
7698F018616J63225k08215J63295k64415J11024p70461L54975J08311J35666l48749
$$ plain form
7765 25242529 24881383 24669039 24825824 24593299 24661346 24539180 23375284 22507824 21787495
7756 21787495 20463596 20093474 19151817 18112050 17643170 17521424 17750828 18488787 18596425
7747 18596425 18962719 18984703 18697898 18601900 18163167 18670842 17854154 18137703 18007393 17827835
7737 17827835 17660017 16745882 15993608 15719843 14534716 13521191 12675561 12208698 11253014
7728 11253014 11088000 10606723 10223666 9914452 9630867 9684353 9174004 9068611 9179084 8819019
7718 8819019 9089619 8412438 8212031 8606871 8106425 8082042 7976213 7356632 7887864 7804773
7708 7804773 7340985 7399515 7229413 7165802 7179120 7086895 6159480 5943456 6155333 6018616
7698 6018616 6181841 5973626 6136921 5872506 5983530 5213069 5568044 5676355 5812021 5463272
7688E463272k61939O57696m05196n06971O80310o56821N23632l19506K41036m41711
7678D973802K59553K0816k97363K02117l44562O83602J74263n59744k30807P37753
7668E619430k76648n225K1742K04024K51275m82387P75703m57545o62115Q0643
7658E068897M47828n86978o675J20441J97173j52954l71358l00345L78539k36831
7648D557737L12330m21257l73058j578J21917m10242K91810p8386L63620n66714
7638C796179k25329O69559o18150l58877K66045M5088J7274M26931n39380N75974
7628D055314l3736J7937m67349L95468K26015j7452o6877L21935K80036p5057
7618D636234L2580N58393O03726q19255N8687L56522l10197m44981K2239j28315
$$ plain form
7688 5463272 5201333 5859029 5453833 4946862 5627172 4970351 5493983 5174477 5415513 4973802
7678 4973802 5233355 5254171 4956808 5158925 4814363 5497965 5672228 5112484 4881677 5619430
7668 5619430 5342782 5337557 5359299 5563323 5814598 5332211 6107914 5650369 4988254 5068897
7658 5068897 5516725 4929747 4923072 5043513 5240686 5087732 4716374 4416029 4794568 4557737
7648 4557737 4870067 4448810 4075752 4074174 4196091 3785849 4077659 3999273 4362893 3796179
7638 3796179 3570850 4240409 3622259 3263382 3529427 3574515 3591789 4018720 3479340 4055314
7628 4055314 4021578 4039515 3572166 3967634 4193649 4176197 4109320 4431255 4711291 4636234
7618 4636234 4668814 5227207 5830933 5011678 5070365 5426887 5116690 4671709 4693948 4565633
7608D565633N18383k51775L94831j89000O69433p13528L55186m07434M40856J31114
7598E513699K76640L65556j00460J88340k38606j9228Q82355p98966j44071L61272
7588F286531j037439N91424n09735k09094q3855l90250P32656m83127K58102n81417
7578D573796M09037L48658j9796M01421J42897J20101K88647l55275L00961n8507
7568F151940M01500o65803K5656o26217r1908l99567L29688J6773L09921o61384
7558D790599j38779J13329J9776L91216j16037L99783l97403l02137M41153K39836
7548E441336k59724j16158K5397K94502k73401n1583j92721N86635m44617l7530
7538D972136M2041k42928L75057M7362Q8446l1947J69095m99182N58028k14701
$$ plain form
7608 4565633 5084016 4832241 5227072 5038072 5707505 4993977 5349163 4941729 5382585 5513699
7598 5513699 5790339 6155895 6055435 6243775 6005169 5985941 6868296 6069330 5925259 6286531
7588 6286531 5249092 5840516 5330781 5121687 5037832 4647582 5380238 4897111 5155213 4573796
7578 4573796 4982833 5331491 5311695 5713116 5856013 5976114 6264761 5909486 6210447 6151940
7568 6151940 6553440 5887637 5913293 5287076 5195168 4795601 5125289 5142062 5451983 4790599
7558 4790599 4651820 4765149 4784925 5176141 5060104 5459887 5062484 4760347 5201500 5441336
7548 5441336 5181612 5065454 5090851 5385353 5111952 5060369 4867648 5454283 5009666 4972136
7538 4972136 5014177 4771249 5146306 5193668 5282114 5250167 5419262 4920080 5478108 5263407
7528E263407J10080k07292N16325l12384P42171m40645L83799j15412k69255O23346
7518F294140j081377P10151J69663p2954K93582n49685O42702m03761k15814N90791
7508F377438j67325K89155m10474O25670n54111J06983K37744J23464Q4675J27068
7498F840287k39140K70271m2147k47158k06223J8440m05534O18403N122l05175
7488F307146J09130K81177k64547j04922J84450J37590k26780M09644l39663L46845
7478F840070l66369L85535j70023j05752M61284n05095M1076k27959k88034K62801
7468F327534k44981L42564j02706m77797K14304j28054j19588J9759n94224M59938
7458E696749l28514l41795M06375k56693J7778J77085K72089m04802l288m34461
$$ plain form
7528 5263407 5373487 5166195 5682520 5370136 6112307 5671662 6055461 5940049 5670794 6294140
7518 6294140 5212763 5922914 6092577 6019623 6313205 5763520 6406222 6002461 5786647 6377438
7508 6377438 6210113 6499268 6088794 6714464 6160353 6267336 6505080 6628544 6713219 6840287
7498 6840287 6601147 6871418 6829271 6582113 6375890 6394330 5988796 6607199 6612321 6307146
7488 6307146 6416276 6697453 6432906 6327984 6512434 6650024 6423244 6832888 6493225 6840070
7478 6840070 6473701 6859236 6689213 6583461 7044745 6539650 6580726 6352767 6064733 6327534
7468 6327534 6082553 6425117 6322411 5844614 6058918 5930864 5811276 5831035 5236811 5696749
7458 5696749 5368235 5026440 5432815 5176122 5193900 5370985 5643074 5238272 5234984 4800523
7448D800523O20525n05140j32271K3755O18148n84071l18565k27450K46450M92309
7438E034213l44493n08615P2415j25881k01443M17779j83070J11057J51562j64864
7428D258660J81407l7435J84683K79889m01652n15438N26155l06906J96819K9077
7418D395259R0478l34352L49316m16821L24422J02923J67218k80301r9550n7269
7408D241323K16184q2504N14629J50477n69216L04092R5161r9778l30992P57573
7398E196949O8551M81306Q04310q45882J71710P64066k85293J093408k99783K19333
7388G368675K21200K19616K05628J041428n62437P08173J7788M33307O52626J24674
7378A0430678M79578J4654N72922O33947M71035j29057K90178O38629M8072M25079
$$ plain form
7448 4800523 5421048 4915908 4783637 4807392 5425540 4841469 4522904 4295454 4541904 5034213
7438 5034213 4689720 4181105 4253520 4127639 3926196 4343975 4160905 4271962 4423524 4258660
7428 4258660 4440067 4402632 4587315 4867204 4465552 3950114 4476269 4169363 4366182 4395259
7418 4395259 4485737 4151385 4500701 4083880 4408302 4511225 4678443 4398142 4298592 4241323
7408 4241323 4457507 4375003 4889632 5040109 4470893 4774985 4870146 4770368 4439376 5196949
7398 5196949 5265500 5746806 6551116 5705234 5876944 6641010 6355717 7449125 7149342 7368675
7388 7368675 7589875 7809491 8015119 9056547 8494110 9202283 9220071 9653378 10306004 10430678
7378 10430678 10910256 10924910 11497832 12131779 12602814 12473757 12763935 13402564 13450636 13875715
7368A3875715J31646L23441K80623K4296k38792l30655l26385K744l45068j99481
7358A3198084j32494j4428q51390K63809m51967o13761q44089n3502m00236j52340
7348I947686j251721n4736n51422o602o56230J40146L6084p75097o031n07441
7338F314636r04045M71938j88387k55978k06601O697J75574q23324J15176L51988
7328E057674j083605P05665j89087K71066j96641q81272J04124O35985k25064
7319D198845k93148M18564l26492J59590l14672L60077R1747l2606n2993o3346
7309D145566n06287O5275N43618m80761m92552N12383J69884m60465J17157K5798
7299C639616l71972K41990J03697l37786j80979N68616k0153n57777R02843r47222
$$ plain form
7368 13875715 14007361 14330802 14611425 14635721 14396929 14066274 13739889 13742633 13397565 13198084
7358 13198084 13065590 13051162 12199772 12463581 12011614 11397853 10553764 10500262 10100026 9947686
7348 9947686 8695965 8641229 8089807 8083205 7426975 7567121 7603205 6828108 6822077 6314636
7338 6314636 5410591 5882529 5694142 5438164 5231563 5238260 5413834 4590510 4705686 5057674
7328 5057674 3974069 4679734 4490647 4761713 4565072 3683800 3787924 4423909 4198845
7319 4198845 3905697 4324261 3997769 4157359 3842687 4202764 4294511 4261905 4208912 4145566
7309 4145566 3639279 3704554 4248172 3767411 3274859 3787242 3957126 3496661 3613818 3639616
7299 3639616 3267644 3509634 3613331 3275545 3094566 3663182 3643029 3085252 3988095 3040873
7289C040873O46790l90242m1156j79333j886J51791l57002N56897n84309K1869
7279B864292m6017N9594K69988j37751j26501q7401L45726l4399J4271j1099j64957
7268B945746k76227M35403l56455K9968N16913o30184L73447K4897O1608K15503
7258C340619n22289m47762K46160K63795n0048n64517Q88762J58602k33408l43095
7248B736819L31973p26543N66225k55638J14087n01369L17130M16327K20123p51718
7238B467416K33894N66191m90924j99574L77120K86478m51786M75694m52885N62682
7228C374306n3130j03354m49297O05188K46395j76530l51584J37327j54805J88353
7218C262869n28235O98244k17208L85255k72744k02753k163K84096K95109J94558
$$ plain form
7289 3040873 3687663 3297421 3256265 3076932 3075046 3226837 2869835 3426732 2842423 2864292
7279 2864292 2818275 2877869 3147857 3010106 2883605 2796204 3141930 3107531 3121802 3110703 2945746
7268 2945746 2669519 3104922 2748467 2778435 3295348 2665164 3038611 3063508 3125116 3340619
7258 3340619 2818330 2370568 2616728 2880523 2830475 2265958 3154720 3313322 3079914 2736819
7248 2736819 3068792 2342249 2908474 2652836 2766923 2265554 2582684 2999011 3219134 2467416
7238 2467416 2701310 3267501 2776577 2577003 2954123 3240601 2788815 3264509 2811624 3374306
7228 3374306 3321176 3217822 2768525 3373713 3620108 3443578 3091994 3229321 3074516 3262869
7218 3262869 2734634 3432878 3215670 3600925 3328181 3125428 3123265 3407361 3702470 3897028
7208C897028r2659k32201K00303l03377J00469m69740L58293K74141n89776J97428
7198C339909j57691j67625J212j6759R56516p23762m8981l00084J64590L47921
7188C395246j78659n10103K69975l27656j77978Q99169k36275k09088L23277J06916
7178C354824l544k20801O06484n89119K17872l59107Q35139j466950Q05303L9375
7168C219476k57516M26077p65823L00594L14817j26192L38715o98268J95898n10278
7158B437500O68865o40097N33932k56184Q6074J2300P6019L01228o24919M67915
7148C062633l8485k36478n36837M98973j86235M23814o26930N86706l12948r5815
7138B538398k72804Q08698j95172J97200p77527Q8844J21098P6910K58333m33217
$$ plain form
7208 3897028 3804369 3572168 3772471 3469094 3569563 3099823 3458116 3732257 3142481 3339909
7198 3339909 3182218 3014593 3015805 2999046 3955562 3231800 3182819 2882735 3047325 3395246
7188 3395246 3216587 2706484 2976459 2648803 2470825 3369994 3133719 2924631 3247908 3354824
7178 3354824 3351280 3130479 3736963 3147844 3365716 3006609 3841748 2374798 3180101 3219476
7168 3219476 2961960 3388037 2622214 2922808 3237625 3111433 3450148 2751880 2947778 2437500
7158 2437500 3106365 2466268 3000200 2744016 2830090 2842390 2918409 3219637 2594718 3062633
7148 3062633 3024148 2787670 2250833 2749806 2563571 2987385 2360455 2947161 2634213 2538398
7138 2538398 2265594 3074292 2879120 3076320 2298793 2387637 2508735 2585645 2843978 2410761
7128B410761L66632J49641j00726q3334j03494Q3930L21729j42850j41805j21661
7118B638823Q17898q56418K41011j43771K51443M1967j23027J96042n23593K85034
7108B825409n2931N83082k25888n90547M39117j3435p6938k90267O62304p58544
7098B501362L7501m267K30157J43054K09589m8390m85451K73788k56964Q05784
7088C406163n85267K57455j76119j44308L66454j96115n9909m29043L77291j9823
7078B796779L23841l50841O0130k21092N30420j57015O1802M31713k61121l99087
7068B815529L79114j56774n30162M33451J30834k35555M62650K00046n42584J17945
7058C074494M79476l15085j63200M37170l89790p7278J74545j41586K15300p02161
$$ plain form
7128 2410761 2777393 2927034 2826308 2742974 2639480 2723410 3045139 2902289 2760484 2638823
7118 2638823 3456721 2600303 2841314 2697543 2948986 2990953 2867926 3063968 2540375 2825409
7108 2825409 2772478 3355560 3129672 2539125 2978242 2964807 2887869 2597602 3259906 2501362
7098 2501362 2538863 2534596 2764753 2907807 3117396 3069006 2583555 2857343 2600379 3406163
7088 3406163 2820896 3078351 2902232 2757924 3124378 2928263 2868354 2439311 2816602 2796779
7078 2796779 3120620 2769779 2829909 2608817 3139237 2982222 3044024 3475737 3214616 2815529
7068 2815529 3194643 3037869 2507707 2941158 3071992 2836437 3299087 3499133 2956549 3074494
7058 3074494 3553970 3238885 3075685 3512855 3123065 3045787 3220332 3078746 3294046 2591885
7048B591885Q40748J10671K9191m31124M9369M04034j43155K56201J04045q34090
7038B977775P6665J29609K25502j51779M65104p11091M60522j4195N3953k53846
7028C258219J00751j9646P82005k57243k00288K92907l0585k50769M23922r7930
7018D001343k14843j02159M3329K20149M2132j02351j57012L28323k41032q45
7008C817034J22490l20202K032K45231N24418m66501k42030J03226k49423M50981
6998C987256o2773M30572m27101M21548k14911j46985K74044O5424R6656o22408
6988C801322Q53930k28790n5878J87203J11808J72990K4430K52931L14907L50644
6978E785497k03815K88418M37414j11819m7996J26152j17298M64897J07368j59483
$$ plain form
7048 2591885 3432633 3543304 3572495 3141371 3190740 3594774 3451619 3707820 3811865 2977775
7038 2977775 3054440 3184049 3409551 3257772 3722876 3011785 3472307 3458112 3512065 3258219
7028 3258219 3358970 3339324 4121329 3864086 3663798 3956705 3926120 3675351 4099273 4001343
7018 4001343 3786500 3684341 3727670 3947819 3989951 3887600 3730588 4058911 3817879 3817034
7008 3817034 3939524 3619322 3621354 3866585 4391003 3924502 3682472 3785698 3536275 3987256
6998 3987256 3924483 4355055 3927954 4349502 4134591 3987606 4261650 4327074 4423730 3801322
6988 3801322 4655252 4426462 4370584 4557787 4669595 4842585 4867015 5119946 5434853 5785497
6978 5785497 5581682 5870100 6307514 6195695 6147699 6273851 6156553 6621450 6728818 6569335
6968F569335L90004N2072M52046K80645k22876K1032N86238O97634L5731R1116
6958H952977l15929j01424q7684k55098l6088O5993l30466k78005n1816N9120
6948G621580n75128k51290J060401j97398p2538p22557O13072M84184m71566K6694
6938G515454m23023J93710l3443m24615K76526R5383l91200J75524l8387o5451
6928F880478o1691L97991M9079k98051M61786j09234L67647q20722O44912L75216
6918G887411Q4392K57451m44203N32529l89995j18975J79684n6852l66550J45516
6908G710408m7048m01578j16114q3637J3674L5717N70626k43380L13494l12926
6898G439236r806K21940r1127J44964L66176M8321O5678Q0719K5558k6309l79061
$$ plain form
6968 6569335 6959339 7011411 7463457 7744102 7521226 7542258 8128496 8826130 8861861 8952977
6958 8952977 8637048 8535624 8447940 8192842 8156754 8222747 7892281 7614276 7562460 7621580
6948 7621580 7046452 6795162 7855563 7658165 7585627 6863070 7476142 7960326 7488760 7515454
6938 7515454 7092431 7286141 7252698 6828083 7104609 7199992 6808792 6984316 6945929 6880478
6928 6880478 6818787 7216778 7265857 6967806 7429592 7320358 7688005 6867283 7512195 7887411
6918 7887411 7971803 8229254 7785051 8317580 7927585 7808610 7988294 7931442 7564892 7710408
6908 7710408 7663360 7261782 7145668 7062031 7075705 7111422 7682048 7438668 7752162 7439236
6898 7439236 7429430 7651370 7560243 7705207 8071383 8119704 8185382 8266101 8291659 8265350 7886289
6887G886289k59047N9537j75855L30941N738j25301M29801l4577l99637O56949
6877H374838j86309J53159L07179M77331n40833P86174K67083J114266l65417
6868A0387471J32556L85128k00995K06703m53355j12903k89737J4157m7514l4733
6858I986778J20378l0777k01605J16234L13136j21815O5605N03556K45953J64649
6848A1162092N98403Q19121L21350L36933R5973O13309j7873j17063K0282o60810
6838A3171717J60058m49882o44471J50258q93555L63334n12289k18446M14133
6829A1540857m15514N11057j91197P3866J18478K06154R15807N27555K47749L99614
6819A3934426j23096L99410J90371j73472L93525J94473l93603J31953P19299
$$ plain form
6887 7886289 7627242 7686779 7510924 7841865 7847603 7722302 8152103 8117526 7717889 8374838
6877 8374838 8188529 8341688 8648867 9126198 8585365 9371539 9638622 10752888 10387471
6868 10387471 10520027 10905155 10704160 10910863 10457508 10344605 10054868 10069025 10021511 9986778
6858 9986778 10107156 10076379 9874774 9991008 10304144 10182329 10247934 10751490 10997443 11162092
6848 11162092 11760495 12579616 12900966 13237899 13333872 13947181 13929308 13812245 13832527 13171717
6838 13171717 13331775 12881893 12237422 12387680 11494125 11857459 11345170 11126724 11540857
6829 11540857 11125343 11636400 11445203 11519069 11637547 11843701 12759508 13287063 13534812 13934426
6819 13934426 13811330 14210740 14401111 14227639 14621164 14815637 14422034 14553987 15273286
6810A5273286j04363J482167R7025J621646P85686J459301m71812J67421q10849
6801A9499508j008787p50917o23856j85085j33482m05693K99479o32099N27471
6792A6586539M0699J46346O38615O87778N99119J038097J483623R39696J394988
6783B3555500J308067J341016J909238J576111K745424J028290J151382l89505
6775C4225523l62793k392166j561949j178278j091826j462456n53333j22422M2387
6766B5542687M70849L04176J036630R94756J397226J235496K133939J082889J566534
6757C5765182R61626P55890O21206J743941P52535J182025J531183J492030N90079
6748D5395697l02247q01348j156300j034713n56499j085235p13678q42387J28512
$$ plain form
6810 15273286 15168923 16651090 16748115 18369761 19155447 20614748 20142936 20310357 19499508
6801 19499508 18490721 17739804 17115948 16930863 16797381 16391688 16691167 16059068 16586539
6792 16586539 16627238 16773584 17412199 18099977 18699096 19737193 21220816 22160512 23555500
6783 23555500 24863567 26204583 28113821 29689932 32435356 33463646 34615028 34225523
6775 34225523 33862730 31470564 29908615 28730337 27638511 26176055 25622722 25500300 25542687
6766 25542687 26013536 26317712 27354342 28349098 29746324 30981820 33115759 34198648 35765182
6757 35765182 36726808 37482698 38103904 39847845 40600380 41782405 43313588 44805618 45395697
6748 45395697 45093450 44292102 43135802 42101089 41544590 40459355 39745677 38903290 39031802
6739C9031802L56809O37640O07446J726518Q05206J486306J354761J154401J576920
6730D8737809J014958J186707J273200J159881J222992L47120J179259j13965
6722E6007961L5651p47825j061995j781165j635468k065477j137197k308522j060652
6713D4245311j079869m29789J026M63498O62162R46737R60326J467916J085645
6704D8322963J228698Q03185J11168L30819o21297o91170n05564p26726j661099
6695D6590977j526815j036108j762883j781323j146369j071221j768369j151031
6687C5346858j176473r72514p68737k08015N36620O405J17142j9721P25122k96465
6677C3290222j40756n47005l71116n69877p02418o63975p24610n97747p89345
$$ plain form
6739 39031802 39388611 40026251 40633697 42360215 43165421 44651727 46006488 47160889 48737809
6730 48737809 49752767 50939474 52212674 53372555 54595547 54942667 56121926 56007961
6722 56007961 56043612 55295787 54233792 52452627 50817159 48751682 47614485 45305963 44245311
6713 44245311 43165442 42735653 42736679 43200177 43862339 44809076 45769402 47237318 48322963
6704 48322963 49551661 50354846 50466014 50796833 50175536 49484366 48978802 48252076 46590977
6695 46590977 45064162 44028054 42265171 40483848 39337479 38266258 36497889 35346858
6687 35346858 34170385 33197871 32429134 32221119 32757739 32764144 32881286 32861565 33586687 33290222
6677 33290222 33149466 32602461 32231345 31661468 30959050 30295075 29570465 28972718 28183373
6668B8183373J0905n61076K31375r91489K86882p51040N19252n50691K00061m6937
6658B6530615k0468J20579M54436O96444O24647Q62055l3741L65493J75396m13129
6648B9362327K23916R33540l43265P70132Q76023K60331P92928O81537J83083
6639C3740552O171K56643q25321K05857q1318k30418L36629L71253N77129Q08592
6629C5165769R03168Q06936P151R83577M66019R46949M09466L89999N04882J453420
6619D2037336J111489J758060J196419Q28457q08514m77569m09529j082691l33682
6610D3819776n75482q13369j16203K26671N78178J34981N95832J460738J327503
6601D6638625R32757O35310m30679K86141o67757k87958j063308L48524m75593
$$ plain form
6668 28183373 28194278 27633202 27864577 26873088 27159970 26408930 26928182 26377491 26577552 26530615
6658 26530615 26510147 26630726 27085162 27781606 28406253 29268308 29234567 29600060 29775456 29362327
6648 29362327 29586243 30519783 30176518 30946650 31822673 32083004 32875932 33557469 33740552
6639 33740552 33746723 34003366 33178045 33383902 33302584 33072166 33408795 33780048 34357177 35165769
6629 35165769 36068937 36875873 36883024 37866601 38332620 39279569 39689035 40079034 40583916 42037336
6619 42037336 43148825 44906885 46103304 46931761 46123247 45645678 45236149 44153458 43819776
6610 43819776 43244294 42430925 42314722 42541393 43119571 43254552 43850384 45311122 46638625
6601 46638625 47571382 48206692 47776013 48062154 47394397 47106439 46043131 46391655 45916062
6592D5916062J28188q25594o59623O9207p12624n91458L2230R50909k36950Q53147
6582D4923494O67811J608280J617944J898694K478627K291094K285197L63021
6574E8134162j07199n15070k182858j655757k079330j454371j004459j516315
6566D7618803j063713k55628o67210M86621j85792J168947J060570O90220J152420
6557E0005238J958206J923269J771428K507677K587804K063622K496745M67018
6549F5781007N30289r5886j227002n85155j363147k06791l33900o81677j091018
6540F0726720p10753p15590m78773k19355J59999L95429K72655L54383O83039
6531F0467754J083987J699957J493649J457522J354598K430476J911234J242328
$$ plain form
6592 45916062 46044250 45218656 44559033 44628240 43915616 43324158 43356388 44307297 44070347 44923494
6582 44923494 45591305 47199585 48817529 50716223 53194850 55485944 57771141 58134162
6574 58134162 58026963 57511893 55329035 53673278 51593948 50139577 49135118 47618803
6566 47618803 46555090 46299462 45632252 46118873 45933081 47102028 48162598 48852818 50005238
6557 50005238 51963444 53886713 55658141 58165818 60753622 62817244 65313989 65781007
6549 65781007 66311296 66215410 64988408 64403253 63040106 62833315 62499415 61817738 60726720
6540 60726720 60015967 59300377 58821604 58602249 58762248 59157677 59430332 59784715 60467754
6531 60467754 61551741 63251698 64745347 66202869 67557467 69987943 71899177 73141505
6523G3141505J183245J565498J574604K170381L022635L178619M520417M626796
6515I4983700N475028M804160N255204L530427M280509K828908L163603K385357
6507A26706896K219812J006527J666810J796984K720132L541123M477261O040381
6499A50175926P702897Q972881J1555020J2326642J4918308J6494465J6424345
6492B38570484J9161223J7631381J6064154J1248733N609399J123923k251192
6485C07158105k611534l640374k927746l807776l521330n007537l874816k366584
6477B79400408p69284J565311K965202N096282P046638Q620758J0612186J0112094
6469C24649595R034465P958799O323854O065093N896427O721021P619023N514778
$$ plain form
6523 73141505 74324750 75890248 77464852 79635233 82657868 85836487 90356904 94983700
6515 94983700 100458728 105262888 110518092 114048519 118329028 121157936 124321539 126706896
6507 126706896 128926708 129933235 131600045 133397029 136117161 139658284 144135545 150175926
6499 150175926 157878823 166851704 178406724 190733366 205651674 222146139 238570484
6492 238570484 257731707 275363088 291427242 302675975 308285374 309409297 307158105
6485 307158105 304546571 300906197 297978451 294170675 290649345 285641808 281766992 279400408
6477 279400408 278631124 280196435 283161637 288257919 295304557 303925315 314537501 324649595
6469 324649595 333684060 341642859 347966713 354031806 359928233 366649254 374268277 379783055
6461C79783055J293926m131737p330172r290438q518523q085275q037195r170518
6453C26513123q814129j1417428r999285j0456033q340310n636377l288621k092650
6445B66468290j486861j293824k307812l209411m416299k655894k847367n447658
6437B42803164q531538j2501944j3277540j3831723j2829500j1386046j0307122
6430A60137751q435567q660462p357387o347993o003824n674996m269986l812184
6422A09575352l484791k457322l024450k171719k221445j577643r54029j020275
6414I2663678l86612j473350j416909r20328n20739j762099j039888j338741k009362
6405H1795650p92759j422925k035861p00553p99791r70983r22099K75578q73158
$$ plain form
6461 379783055 381076981 376945244 369615072 360324634 351806111 343720836 335683641 326513123
6453 326513123 317698994 306281566 296282281 285826248 277485938 271849561 268560940 266468290
6445 266468290 264981429 263687605 261379793 258170382 253754083 251098189 248250822 242803164
6437 242803164 234271626 221769682 208492142 194660419 181830919 170444873 160137751
6430 160137751 151702184 143041722 135684335 129336342 123332518 117657522 113387536 109575352
6422 109575352 106090561 103633239 100608789 98437070 96215625 94637982 93683953 92663678
6414 92663678 92277066 90803716 89386807 88466479 87945740 86183641 85143753 83805012 81795650
6405 81795650 81002891 79579966 77544105 76843552 76043761 75072778 74150679 74426257 73553099
6396G3553099j60933K51689m20919N04258K36325J53116M53563L3766R1921K08009
6386G4903894L98596j06446j255426o05869j662680j547092j504965j658943q06496
6377F6154573j564818j200565j268713m49694j099463m88576l56285n67262o12200
6368E8546997L15154J01403J34677q7959m80345P81235j77027r78854j113671
6359E7041610j577534r91917r51721r94931j558766o48443j569920j123526q87995
6350D6736857m40461k149122m24471q4119j278436K67425j181433n28649j65246
6341D0752345M25694o679m00692n12364K95768r3262L10396j28821J89453m14422
6331D0417416P24007K93597k95351L95332l90041P04995K7005N52540K82411m18841
$$ plain form
6396 73553099 73392166 73643855 73222936 73727194 73963519 74116635 74570198 74603964 74695885 74903894
6386 74903894 75302490 75196044 73940618 73334749 71672069 70124977 68620012 66961069 66154573
6377 66154573 64589755 63389190 62120477 61670783 60571320 60082744 59726459 59159197 58546997
6368 58546997 58862151 58963554 59098231 59010272 58529927 59311162 59134135 58155281 57041610
6359 57041610 55464076 54472159 53520438 52525507 50966741 50318298 48748378 47624852 46736857
6350 46736857 46296396 44147274 43722803 43638684 42360248 42627673 41446240 40917591 40752345
6341 40752345 41178039 41171360 40770668 40258304 40554072 40460810 40771206 40642385 40831838 40417416
6331 40417416 41141423 41435020 41139669 41535001 41144960 41849955 41876960 42429500 42711911 42293070
6321D2293070N68251l07830J59273j45933k36476Q0026M15589K50854J092665
6312D4169489J61570O94333r745J393411P0058J853210o13205P02934o8006n00916
6302D7853133r87717K55982l34919m78878n11966k14862m96506k91011o51170
6293D4142086O9203M4105k92891J77567L37305N41880Q57752L11891J723905O37839
6283D8550642J869231J199030K40189r8807m83820j79510l38172k82958k93850
6274E0181975k04035n92537K30073k09388L30876l75322m10005l75271M31715
6265D9008081n52780n91092N35989j50165k14657R06536j07669M87976K2923j18650
6255D9226492L96019m14390j91814J081240n9287J18724O79166K10899l08054
$$ plain form
6321 42293070 42861321 42553491 42712764 42566831 42330355 42410381 42825970 43076824 44169489
6312 44169489 44331059 45025392 45015647 46409058 46479116 48332326 47719121 48422055 48354049 47853133
6302 47853133 46865416 47121398 46786479 46307601 45795635 45580773 45084267 44793256 44142086
6293 44142086 44211289 44255394 43962503 44140070 44477375 45019255 45877007 46188898 47912803 48550642
6283 48550642 50419873 51618903 51859092 51760285 51276465 51096955 50758783 50475825 50181975
6274 50181975 49977940 49385403 49615476 49406088 49736964 49361642 48951637 48576366 49008081
6265 49008081 48455301 47864209 48400198 48250033 48035376 48941912 48834243 49322219 49345142 49226492
6255 49226492 49622511 49208121 49016307 50097547 50038260 50156984 50836150 51047049 50738995
6246E0738995j429039j01051m45186j42182o84271o58307k68071n95304p12947
6237D5702637J40160o27249k35120r97648r9577l24822j29476j89087o30606Q18074
6227D3427286L66479o06375L07001p22966j8770l18801l95366o28234O72016K42387
6217D2324657N98828p16118J61676M58207k52560p97130j187758j507225q01290
6208C8281287p52827j418898k36530j014302k76637r07273r67604j45252o03910
6199C1958054q19432N6294l67299k20672k39122m71551l26290k59861Q5776l43682
6189B9052215o07095q44956q82162n81950p93185p02172o62055j087595p4558
6180B2816487p05176o84348K93503l12905j33383j75822l61258M74348m60057
$$ plain form
6246 50738995 49309956 49208905 48763719 48621537 47937266 47278959 47010888 46415584 45702637
6237 45702637 45842797 45215548 44980428 43982780 43883203 43558381 43428905 43239818 42609212 43427286
6227 43427286 43793765 43187390 43494391 42771425 42752655 42433854 42038488 41410254 42082270 42324657
6217 42324657 42923485 42207367 42369043 42827250 42574690 41777560 40589802 39082577 38281287
6208 38281287 37528460 36109562 35873032 34858730 34582093 33674820 32707216 32561964 31958054
6199 31958054 31138622 31194916 30827617 30606945 30367823 29896272 29569982 29310121 29395897 29052215
6189 29052215 28445120 27600164 26718002 26136052 25342867 24640695 23978640 22891045 22816487
6180 22816487 22111311 21426963 21720466 21407561 21274178 21098356 20737098 21211446 20751389
6171B0751389L07750o90638K20312O89K06221r56340N35557r73915j82482J70013
6161A9388556n35608l21282j43110k24065l3606n97643J06553L2073J00498k280
6151A7770086K95987j51485k67014K36192j76471j5506r5318p5703n59636m14323
6141A6546809q63153K86705k80069m6850q0914N7614j34561J58948l52080j1912
6131A5280537K13839K00661J53465k04076J21422N92009P36935L13430K40484
6122A7648706J29448Q56091m98376j11022q08341M8834r48390p85800k36592M90458
6112A5785016j177110N48780k41051j14688K80634m93324P54627J51016J06160
6103A5600060O56267N27338R53600J051526M45371J584174j39883k57854l62088
$$ plain form
6171 20751389 21059139 20368501 20588813 20589502 20795723 19839383 20374940 19401025 19218543 19388556
6161 19388556 18852948 18531666 18388556 18164491 18130885 17533242 17639795 17671868 17772366 17770086
6151 17770086 18066073 17914588 17647574 17883766 17707295 17691789 17596471 17520768 16961132 16546809
6141 16546809 15683656 15970361 15690292 15643442 15562528 15620142 15485581 15644529 15292449 15280537
6131 15280537 15494376 15695037 15848502 15644426 15765848 16357857 17094792 17408222 17648706
6122 17648706 17778154 18634245 18135869 18024847 17216506 17265340 16316950 15531150 15294558 15785016
6112 15785016 14607906 15156686 14915635 14800947 15081581 14588257 15342884 15493900 15600060
6103 15600060 16256327 16783665 17737265 18788791 19234162 20818336 20678453 20420599 20058511
6094B0058511q62586r79077p66875k63041p14546m15616l14306j079725k77076
6085A4385663N44242l92953J58608K26530j66939k47343O29920K46442L3552O28494
6075A6046216Q35398j6431L76293M08231q73460l9188o05883n94010L8928l70856
6065A5205238J5526o57331p32698M36112q22414J31473k67292l15021M68905n80255
6055A2882243J8203N14352p14199Q2829K7393K18557K14501o96063j73367P43794
6045A3118243j30855q6297M79237o74622M93798j99771n07876L52858K87386l51300
6035A2780801K9696k83701L14010n42224j56982L37557m4487j30194J84022j80645
6025A2307853m57159O54399O72379o25821l89942K75308j33446K93826o35844
$$ plain form
6094 20058511 19195925 18216848 17449973 17186932 16472386 16056770 15742464 14662739 14385663
6085 14385663 14929905 14536952 14695560 14922090 14755151 14507808 15137728 15384170 15417722 16046216
6075 16046216 16881614 16865183 17241476 17649707 16776247 16737059 16131176 15537166 15576094 15205238
6065 15205238 15220764 14563433 13830735 14266847 13444433 13575906 13308614 12993593 13462498 12882243
6055 12882243 12900446 13414798 12700599 12783428 12810821 13029378 13243879 12547816 12374449 13118243
6045 13118243 12987388 12901091 13380328 12705706 13199504 12999733 12491857 12844715 13132101 12780801
6035 12780801 12810497 12526796 12840806 12298582 12141600 12479157 12434670 12304476 12488498 12307853
6025 12307853 11850694 12505093 13177472 12551651 12161709 12437017 12303571 12597397 11961553
6016A1961553k27437l58952P51820m02335j16554J41425k94960j85778l8730m42442
6006A0787610M95999j05461r2903K90524m30534o11872N07520j20133j61765M97156
5996A1056141r05828K75460p80060N79945k35804q9583J53609k63980J45940J21073
5986A0056913k39879P0748j90487L08549j7533k41746M0421m99690J49734m40768
5976H996262N63323o71167L16714M2321k73152p0286q77752M57701K87296p9139
5966H692121R6718m74432K54973o9350J5823r0406q3173J59922k25564K60050
5956H536682J42443j22266l53148R6464J3948L30481p63165M18553J69210Q6801
5946H556003n82979j29311M80162j78750L99765k70746j61077j10238j99872m1314
$$ plain form
6016 11961553 11734116 11375164 12126984 11724649 11608095 11749520 11454560 11268782 11230052 10787610
6006 10787610 11283609 11178148 11085245 11375769 10945235 10333363 10840883 10720750 10558985 11056141
5996 11056141 10150313 10425773 9645713 10225658 9989854 9900271 10053880 9789900 9935840 10056913
5986 10056913 9817034 9887782 9697295 10005844 9988311 9746565 9786986 9287296 9437030 8996262
5976 8996262 9559585 8888418 9205132 9247453 8974301 8904015 8026263 8483964 8771260 8692121
5966 8692121 8788839 8314407 8569380 8500030 8515853 8425447 8342274 8502196 8276632 8536682
5956 8536682 8679125 8556859 8203711 8300175 8314123 8644604 7881439 8299992 8469202 8556003
5946 8556003 7973024 7843713 8323875 8145125 8544890 8274144 8113067 8002829 7802957 7761643
5936G761643N31618m80163L63635k66276K29926J18910o26795M42652M38691o73735
5926G840106q2762N01654l15513n4734Q394m35613Q09099j83340n1533l8524m59369
5915G537865N69244j6532l86145N6334l19363M82449n02419J34916L27693Q2698
5905G966740J3439J3911J07205o69457M88222r40208O65542L47754m77312j30264
5895G385572Q9281m004m74516N34330n50612R82543p17825k71535l61885O16115
5885G227464K8946j28921K19076R7755k50516K83040k38332p03873P27054m37469
5875F824224j17094K7727l83007J84152O3501M20779l2670r6850n38751M2374
5865F394385N68270l44656k84214j93769L99042R4257p14252M27701M08810o30376
$$ plain form
5936 7761643 8293261 7813098 8176733 7910457 8140383 8259293 7632498 8075150 8513841 7840106
5926 7840106 7757344 8258998 7943485 7888751 7897145 7461532 8270631 8087291 8035758 7997234 7537865
5915 7537865 8107109 8090577 7704432 7760766 7441403 7923852 7421433 7556349 7884042 7966740
5905 7966740 7980179 7994090 8101295 7431838 7920060 6979852 7645394 7993148 7515836 7385572
5895 7385572 7474853 7470849 6996333 7530663 6980051 7962594 7244769 6973234 6611349 7227464
5885 7227464 7256410 7127489 7346565 7444320 7193804 7476844 7238512 6534639 7261693 6824224
5875 6824224 6707130 6734857 6351850 6536002 6599503 7020282 6987612 6890762 6352011 6394385
5865 6394385 6962655 6617999 6333785 6140016 6539058 6633315 5919063 6346764 6755574 6125198
5855F125198K66240J49387l51583L00278L25650m50095O58396r6679J55777k12724
5845F869845l2434j9582J47722j70873M10956n166m24372j11429J120492l26852
5835G458307O42604q39799K37617J48239K76034n27746M25088p2029k80324N17829
5825G985820l17163J36223j40176n5539j3697L10582j66056O98220j90880K67053
5815H514387k65530M87334q0878J17561M09235j64915J162699L39347J50786m9331
5805A0620695M83843j79210O88391l61365k68880N2265K2334p43731R0342j03518
5795A0301166n15667k20282L65860j79533K48522p67172O33106n05222O76009
5786A0036787P2598N30125J780K12618L1876M45186R4015L62407L92280L96426
$$ plain form
5855 6125198 6391438 6540825 6189242 6489520 6815170 6365075 7023471 6926792 7082569 6869845
5845 6869845 6837411 6817829 6965551 6794678 7205634 7200468 6776096 6664667 7785159 7458307
5835 7458307 8100911 7261112 7498729 7646968 7923002 7395256 7820344 7748315 7467991 7985820
5825 7985820 7668657 7804880 7664704 7609165 7595468 7906050 7739994 8438214 8247334 8514387
5815 8514387 8248857 8736191 8655313 8772874 9182109 9017194 10179893 10519240 10670026 10620695
5805 10620695 11104538 10925328 11613719 11252354 10983474 11035739 11058073 10314342 10404684 10301166
5795 10301166 9785499 9565217 9931077 9751544 10000066 9232894 9866000 9360778 10036787
5786 10036787 10109385 10639510 10641290 10853908 10885784 11330970 11424985 11787392 12179672 12576098
5776A2576098j82534k8698l60294j80166O48552r26825o21135O9190n11515K94843
5766A0777516p67610O5269l03792n91089k5746k4742J35317n23467j70380K00499
5756H771775J36900k77819l13209O34868k85971L54424k13565J29454o68596O62461
5746H930722n53295j73617J69402k70910R567m71602l78848l69012N45157p11077
5736F726487N42541r87682N27056j15923J41460k59202J293m51237J71794q2579
5726F214008O8432m61949M5433K66560l41267J86834L48928m23774L81462K5521
5716F310188o79020M47438k26133K22302j29060l17149K47424m53117P61490M202
5706F188565r40583N43052q5085K24268o23308L4312J89112J14520o12913K25708
$$ plain form
5776 12576098 12393564 12364866 12004572 11824406 12472958 11546133 10924998 10994188 10482673 10777516
5766 10777516 10009906 10075175 9771383 9180294 9154548 9129806 9265123 8741656 8571276 8771775
5756 8771775 8908675 8630856 8317647 8952515 8666544 9020968 8807403 8936857 8268261 8930722
5746 8930722 8377427 8203810 8373212 8102302 8111869 7640267 7261419 6892407 7437564 6726487
5736 6726487 7269028 6281346 6808402 6692479 6833939 6574737 6576030 6124793 6296587 6214008
5726 6214008 6282440 5820491 5865924 6132484 5791217 5978051 6326979 5903205 6284667 6310188
5716 6310188 5631168 6078606 5852473 6074775 5945715 5628566 5875990 5422873 6184363 6188565
5706 6188565 5247982 5791034 5705949 5930217 5306909 5341221 5530333 5644853 5031940 5257648
5696E257648L27126m61745k98270L82711n3641Q46510m50108p88885Q78517j32947
5686E506916k77616O3913P3193p7361p53718Q41835K05839n44410k58400m0101
5676D740090L87809K17347J38435j32761J21755l39399m19150M60326o9158j35879
5666D969415K73383J2354l43902K28759k21481J08540K50920j53633J19346L48040
5656E591741r84678Q08128k79343K5085J56785m30623O09015n41770J63627J20187
5646E238154j48901L75998K03378l76457o38650Q82041m27277O23328l78900K52003
5636E604717k41609K19073L96368j010670O25111k34468K33550J66528q7552j16377
5626E554671L00899n65926L70070j18401L22175m95058J482j57322O18521j97178
$$ plain form
5696 5257648 5584774 5123029 4824759 5207470 5153829 6000339 5550231 4761346 5639863 5506916
5686 5506916 5229300 5293213 5366406 5289045 4535327 5377162 5583001 5038591 4780191 4740090
5676 4740090 5127899 5345246 5483681 5350920 5472675 5133276 4714126 5174452 5105294 4969415
5666 4969415 5242798 5255152 4911250 5140009 4918528 5027068 5277988 5124355 5243701 5591741
5656 5591741 4607063 5415191 5135848 5160933 5317718 4887095 5496110 4954340 5117967 5238154
5646 5238154 5089253 5465251 5668629 5292172 4653522 5535563 5108286 5731614 5352714 5604717
5636 5604717 5363108 5582181 5978549 4967879 5592990 5358522 5592072 5758600 5671048 5554671
5626 5554671 5855570 5289644 5659714 5541313 5863488 5368430 5369912 5212590 5831111 5633933
5616E633933p0371O24546q25129m94833L50717k11320K79644M1170N92189J61871
5606F082417J45493j71086m81564L86047K9651M73524N1902o5680l18345J82102
5596F314461j15314J91918j80546O8756j52312j01718m48137k3337L97896J90838
5586F142505p6109J16719k17633K90334O26283m8614o3647j11666L51330j2641
5576F996861N81311j64510k9489M4909n49762j67613j30113M39648K17749m89133
5566F749858L6811K11139K03018j93507P0449M20308J40077N52682K63012J23665
5556H577512M31583q07825J37787o3830j77981N5507o2198p14301L33324k40457
5546G469121l32088j95009L60162R4108m80373O64367K08244k79581j2852k22789
$$ plain form
5616 5633933 5563562 6188108 5362979 4868146 5218863 5007543 5287187 5328357 5920546 6082417
5606 6082417 6227910 6056824 5575260 5961307 5990958 6464482 6516384 6450704 6132359 6314461
5596 6314461 6199147 6391065 6210519 6279275 6126963 6025245 5577108 5553771 5951667 6142505
5586 6142505 6066396 6183115 5965482 6255816 6882099 6833485 6769838 6658172 7009502 6996861
5576 6996861 7578172 7413662 7384173 7429082 6879320 6711707 6581594 7021242 7238991 6749858
5566 6749858 6786669 6997808 7200826 7007319 7077768 7498076 7638153 8190835 8453847 8577512
5556 8577512 9009095 8201270 8339057 8275227 8097246 8152753 8090555 7376254 7709578 7469121
5546 7469121 7137033 6942024 7302186 7396294 6915921 7580288 7788532 7508951 7496099 7273310
5536G273310j06733J93866K28043L95773j02076m44188M38354p43366J079574
5527H212557q83578K2673M53118q1441K2900J92624k64588N57415O6013n35555
5517G762138P42392K16224k42836K45988P7636N36662k92126M22399L14617M81508
5507A0264602l3242K26137O28226L75580l60618J71933o44111Q55602o67335J84276
5497A1001050q34973K99122j97287k02969O7403l93706n241M14557K67820l61311
5487A0054465K10760K55271K05731N72518R25236l79638O74406Q63604L61162
5478A3743515r2033k88929o9412l76109r47149J24519l56324P9930p62329m97039
5468A0558640j68595n79957K20712j13260P0006j31694k10844m61213M27407M19684
$$ plain form
5536 7273310 7166577 7360443 7588486 7984259 7882183 7437995 7876349 7132983 8212557
5527 8212557 7328979 7351652 7804770 7723329 7746229 7938853 7674265 8231680 8297693 7762138
5517 7762138 8504530 8720754 8477918 8723906 8801542 9338204 9046078 9468477 9783094 10264602
5507 10264602 10231360 10457497 11085723 11461303 11100685 11272618 10628507 11484109 10816774 11001050
5497 11001050 10166077 10465199 10267912 10064943 10132346 9738640 9733399 10147956 10415776 10054465
5487 10054465 10265225 10520496 10726227 11298745 12223981 11844343 12518749 13382353 13743515
5478 13743515 13651482 13362553 13293141 12917032 11969883 12094402 11738078 11818008 11055679 10558640
5468 10558640 10390045 9810088 10030800 9917540 9987546 9855852 9645008 9183795 9611202 10030886
5458A0030886p5076K25527L09013q2020N28380J90749l13351j35075l1101j03021
5448A0544911j63976n84611Q8103k37810O25119m30876r5453k7687o18561N67527
5438I666686P8234j23939L23955m36245M70842n83618Q24231l48293N09729l46553
5428A0035029N25337P0243j3993P98643r1469O03398j32999N28684P85068j62506
5418A2945435Q97222L67395K56873K50368O64509l04253L1205K31430k23934m39915
5408A4676335l50716m82856r6200k66292K59682j064398J54224m4932n27475N17092
5398A2774464N1448j94279j8733K8972L49788K98285K08804k73102j7986L46023
5388A3553684m86054J47220n02740j7600l13456N2947L34342l04591m0971o00317
$$ plain form
5458 10030886 9955810 10181337 10490350 10408330 10936710 11127459 10814108 10679033 10647932 10544911
5448 10544911 10380935 9796324 9884427 9646617 10271736 9840860 9745407 9717720 9099159 9666686
5438 9666686 9744920 9620981 9944936 9508691 9979533 9395915 10220146 9871853 10381582 10035029
5428 10035029 10560366 10630609 10616616 11415259 11323790 11927188 11794189 12322873 13107941 12945435
5418 12945435 13842657 14210052 14466925 14717293 15381802 15077549 15108754 15340184 15116250 14676335
5408 14676335 14325619 13842763 13746563 13480271 13739953 12675555 12829779 12784847 12257372 12774464
5398 12774464 12825912 12631633 12612900 12641872 12991660 13289945 13498749 13225647 13207661 13553684
5388 13553684 13067630 13214850 12712110 12694510 12381054 12434001 12768343 12463752 12422781 11822464
5378A1822464O59021m13094n7584k54536J01507L65806k22452J3222Q273P3500
5368A2096127j38383O19372n50358K39752l4178K97507l19914P7047j78495l74448
5358A1734029K60877M3634N75876p0440P8616k97206l9818R84630l93201N89768
5348A3466765M86859O22379j17261M26687R33456n56147N50237o8532O69762L9122
5338A6453327N14636n72360p86123J15532J26606J38850m51370k77720J085677
5329A6347055J16179O12650k78706k44971N38185l00362j84725j5523N85785L57196
5319A7532763K8418N54733J109509J285743L61390J024415J284928M16741J217070
5310B4815710J196801M78490K48075Q6208j00731q51029n33072m30279K15641
$$ plain form
5378 11822464 12481485 12068391 12010807 11756271 11857778 12223584 12001132 12014354 12022627 12096127
5368 12096127 11957744 12577116 12026758 12266510 12232332 12529839 12209925 12286972 12108477 11734029
5358 11734029 11994906 12038540 12614416 12543976 12622592 12325386 12285568 13270198 12876997 13466765
5348 13466765 13953624 14576003 14458742 14885429 15818885 15262738 15812975 15744443 16414205 16453327
5338 16453327 16967963 16395603 15609480 15725012 15851618 15990468 15539098 15261378 16347055
5329 16347055 16463234 17075884 16797178 16552207 17090392 16790030 16605305 16589782 17175567 17532763
5319 17532763 17561181 18115914 19225423 20511166 20872556 21896971 23181899 23598640 24815710
5310 24815710 26012511 26491001 26739076 26825284 26724553 25873524 25340452 24910173 25125814
5301B5125814r63743j59909p36375k28939o89212p60671N6975j084339m26724
5292B0132877l75803n90041o2540m59247M16186Q40043m27303J017043N26608
5283B1017823Q42580J151560J794760P46490Q46775K32420R41793l66633n19530
5274B6688038q62036J71281j361954m81683o11062q43278j289815m53383p45264
5265B0210844q1879o74460l40506m86075n1009J7832p10360o8860l75956K77434
5255A7717005l5796K68204L6268j88524n3708M22944p0466m2958l14037j37912
5245A7601020O06604p77175m80977O21241K38226j095211N91990m40555k36331
5236A6628832k60041l13060m61442j47189J98605K08018k60171J62961J89874
$$ plain form
5301 25125814 24162071 24002162 23265787 23036848 22347636 21586965 21643940 20559601 20132877
5292 20132877 19757074 19167033 19104493 18645246 19061432 19901475 19474172 20491215 21017823
5283 21017823 21860403 23011963 24806723 25553213 26399988 26632408 27574201 27207568 26688038
5274 26688038 25826002 25997283 24635329 24153646 23542584 22699306 21409491 20956108 20210844
5265 20210844 20128965 19454505 19113999 18627924 18576915 18594747 17884387 17815527 17439571 17717005
5255 17717005 17681209 17949413 17985681 17797157 17743449 18166393 18095927 18052969 17738932 17601020
5245 17601020 18207624 17430449 16949472 17570713 17808939 16713728 17305718 16865163 16628832
5236 16628832 16368791 16055731 15594289 15447100 15645705 15853723 15593552 15756513 15946387
5227A5946387p05496N76027K58047j67701Q6543l5407m7129l91053K23641j14228
5217A5629631q90827P18164n83721L1794m03975N17692n33705l58511K51165J78812
5207A4556519j72231j19350n52170L97140n71178N50202n16751J79953R0611N105
5197A3847850L01017k31466J84472k89179M06817J556P06796j066491j4691R22466
5187A4769147m76978R48441Q2332N01k58022M73507J212240l76266N84714n1288
5177A6908328N62387k19026p98942N99911j33377q79382J083822q0591o25799
5168A6417331L09803l67658L03822o78504J80582R3455P57281N76808k81438M05726
5158A7717208M81638O32766P96181J127516J044979O81645N46610O25256j23603
$$ plain form
5227 15946387 15240891 15816918 16074965 15907264 15993807 15958400 15911271 15520218 15743859 15629631
5217 15629631 14738804 15456968 14873247 14905041 14501066 15018758 14485053 14126542 14377707 14556519
5207 14556519 14384288 14264938 13712768 14109908 13538730 14088932 13572181 13752134 13842745 13847850
5197 13847850 14148867 13917401 14101873 13812694 14219511 14221067 14927863 13861372 13846681 14769147
5187 14769147 14292169 15240610 15322942 15323443 15065421 15538928 16751168 16374902 16959616 16908328
5177 16908328 17470715 17251689 16452747 17052658 16919281 16039899 17123721 17043130 16417331
5168 16417331 16727134 16359476 16663298 15984794 16165376 16258831 17016112 17592920 17311482 17717208
5158 17717208 18198846 18831612 19627793 20755309 21800288 22481933 23028543 23653799 23530196
5149B3530196L6545n01372o59366M9239j164153K73451o02913m30750J45538n92872
5139B0083543K65086r27963O32906l53714m1130K99225j48477M26114M94648J71088
5129B0901326J82977J084265Q86577L43698J795121M92822J121549O10848n61278
5120B6857905j81039K64444k10503p30933q75519K02846n29150r0183o30065j66870
5110B3910933k17949o31601m57049j46399j01448L2597M39688m36938Q13335o44216
5100B2560953M96310M55057K88013Q56347J8626N80837Q69968L52914m86723J034352
5090B7026654J87710j03611j42120J23955m9422k23933K46915n32140n58376K30910
5080B6206542o16455N17264l30138K77424o88612L09847M85451l5948M72315L41670
$$ plain form
5149 23530196 23566741 23065369 22406003 22455242 21291089 21564540 20961627 20530877 20676415 20083543
5139 20083543 20348629 19420666 20053572 19699858 19658728 19957953 19809476 20235590 20730238 20901326
5129 20901326 21084303 22168568 23055145 23398843 25193964 25686786 26808335 27419183 26857905
5120 26857905 26676866 26941310 26730807 25999874 25124355 25327201 24798051 24707868 24077803 23910933
5110 23910933 23692984 23061383 22604334 22457935 22356487 22389084 22828772 22391834 23205169 22560953
5100 22560953 23057263 23512320 23800333 24656680 24675306 25256143 26126111 26479025 25992302 27026654
5090 27026654 27214364 27110753 26968633 27092588 27043166 26819233 27066148 26534008 25975632 26206542
5080 26206542 25590087 26107351 25777213 26054637 25366025 25675872 26161323 26125375 26597690 26939360
5070B6939360n09403P56236j35230L00422M68339k26058R34303M36536P156K47659
5060B9219320N62007K37962K10307n72018O23038L89832M07899K80782K28336
5051C1587465J4586L72769J95834K10809R15340J34558M66172J25856j26333j97876
5041C3699180O22065J95862L90080J76331O39567P07816K73078J412721k17199
5032C7899501J748143N30910R86357J594248N39131R60355J049247R01989J107228
5023D7317109J101929J967462J207712K237176K195344J930372J505357J153727
5015F0616188J386745N73715k79596L91571J87657M08617m25481J62386Q3597
5006F3105399N74501N74266P97380R08549Q86885J093893J234572J349421K617370
$$ plain form
5070 26939360 26429957 27186193 27050963 27351385 27819724 27593666 28527969 28964505 28971661 29219320
5060 29219320 29781327 30019289 30229596 29657578 30280616 30670448 31078347 31359129 31587465
5051 31587465 31602051 31974820 32170654 32381463 33296803 33431361 33897533 34023389 33897056 33699180
5041 33699180 34321245 34517107 34907187 35083518 35723085 36430901 36703979 38116700 37899501
5032 37899501 39647644 40178554 41164911 42759159 43298290 44258645 45307892 46209881 47317109
5023 47317109 48419038 50386500 51594212 53831388 56026732 57957104 59462461 60616188
5015 60616188 62002933 62576648 62297052 62688623 62876280 63284897 62859416 63021802 63105399
5006 63105399 63679900 64254166 65051546 65960095 66846980 67940873 69175445 70524866 73142236
4997G3142236K343021K503423K345525L098767K964098L078553L130970L237610
4989I5844203K994197K316067J486296L30635P55897M51623N4617K61734J399653
4980A05894922K327516K362998L513876K555735K555881J903258K051613J759283
4972A24925082J729405L597303L413404N742406O926675P427387Q333729O634021
4964A68729412O381947L947018L349909J80069j129972l604756n133247m339192
4956A68381188l798919k418435k490622j487385j602612r38176j096172j19436
4948A54429431R32371L121231L476153M695072O293340P712033Q126114P014742
4940A95800487O026269L674445O3997k017402l201261l754715j997098k474818
$$ plain form
4997 73142236 75485257 77988680 80334205 83432972 86397070 89475623 92606593 95844203
4989 95844203 98838400 101154467 102640763 102971398 103727295 104178918 104233535 104495269 105894922
4980 105894922 108222438 110585436 114099312 116655047 119210928 121114186 123165799 124925082
4972 124925082 126654487 130251790 133665194 139407600 146334275 153761662 162095391 168729412
4964 168729412 175111359 179058377 182408286 182588355 181458383 177853627 172720380 168381188
4956 168381188 164582269 162163834 159673212 158185827 156583215 155645039 154548867 154429431
4948 154429431 155361802 158483033 161959186 166654258 172947598 180659631 188785745 195800487
4940 195800487 201826756 205501201 205565198 203547796 200346535 196591820 194594722 192119904
4932A92119904j19100M99685J871965J893300J595219J063633K315295N57990
4924B01797891J55355L20414Q25591O51667J519473J528538M104121L973910N439012
4915B20315972O272770N265365O065879N832757O209613M954254N930761N017383
4907B65864754M956036M111310K193580J092162q52417l791420n731919p594986
4899B60247100q072090n992140m807163k409561j406578o20394O27650J118653
4891B38685477K797451L062476M428679L732697K682766j41753j782245l969320
4883B49496228l398260l630753j851971j612629j166323l375088m095308l698565
4875B26667331l701564j778859n09395p27540K77265l38555J53981o0185R95394
$$ plain form
4932 192119904 192000804 192500489 194372454 196265754 197860973 198924606 201239901 201797891
4924 201797891 201953246 202273660 203099251 203750918 205270391 206798929 210903050 214876960 220315972
4915 220315972 226588742 231854107 237919986 243752743 249962356 254916610 260847371 265864754
4907 265864754 270820790 274932100 277125680 278217842 277365425 273574005 267842086 260247100
4899 260247100 252175010 246182870 241375707 238966146 237559568 236939174 237566824 238685477
4891 238685477 241482928 244545404 248974083 252706780 255389546 255247793 253465548 249496228
4883 249496228 246097968 242467215 240615244 239002615 237836292 234461204 230365896 226667331
4875 226667331 222965767 221186908 220677513 219949973 220227238 219888683 220042664 219982479 220977873
4866B20977873J513033K726067K440304K932839K574890K016561K148115K799372
4858B40129054L209544K483643J805399K180513J231756J998181N76364J022603
4850B54637057P04279O20643n61685j314024l223083l908305m162317l317809
4842B39474756l429812k189839j151696M38202J353226K493459K563712J340627
4834B40892635J865970J395792K998605K224716N109842O489917Q721332R653764
4826B79352573R204372Q856518O320272K723463j079548k696331m543980n580809
4818B92556530n859865n360783l145619k228073j626848j079684j251167j94548
4810B71809943J001292L56135J325189J852102K953447L632474M032803M386352
$$ plain form
4866 220977873 222490906 225216973 227657277 230590116 233165006 235181567 237329682 240129054
4858 240129054 243338598 245822241 247627640 249808153 251039909 253038090 253614454 254637057
4850 254637057 255341336 255961979 255400294 254086270 250863187 246954882 242792565 239474756
4842 239474756 236044944 233855105 232703409 233141611 234494837 236988296 239552008 240892635
4834 240892635 242758605 244154397 247153002 249377718 254487560 260977477 269698809 279352573
4826 279352573 288556945 297413463 303733735 306457198 305377650 302681319 298137339 292556530
4818 292556530 286696665 281335882 278190263 275962190 274335342 273255658 272004491 271809943
4810 271809943 272811235 273167370 274492559 276344661 279298108 282930582 286963385 291349737
4802B91349737L560752J499419J496412K343723L116337M054004N067177M028356
4794C16515917K473636l62582j039253j465341k675142o835314r465337j1394699
4786B85751885j2908509j1466471r350363q605198o359705m523672k438310r53250
4778B29146407J057468J663701J410707J778436J466040K000611M144677M794441
4770B47462488N070259M988069M032801K464856k73659j570864k905258l051956
4762B56216736k052233j353167k065144k278028m552956m564916n236993n095797
4754B29017502n583603n340977m131114l415252k986478k806188l823170l406155
4746A97524565l561762n081307n155355o037554o838366n028317m377899l018544
$$ plain form
4802 291349737 294910489 296409908 297906320 300250043 303366380 307420384 312487561 316515917
4794 316515917 318989553 318626971 317587718 316122377 313447235 306611921 297146584 285751885
4786 285751885 272843376 261376905 252026542 243421344 237061639 232537967 230099657 229146407
4778 229146407 230203875 231867576 233278283 235056719 236522759 238523370 242668047 247462488
4770 247462488 252532747 257520816 261553617 264018473 263744814 262173950 259268692 256216736
4762 256216736 254164503 252811336 250746192 248468164 243915208 239350292 234113299 229017502
4754 229017502 223433899 218092922 213961808 210546556 207560078 204753890 200930720 197524565
4746 197524565 193962803 188881496 183726141 177688587 170850221 165821904 161444005 158425461
4738A58425461k193014j387836j403679m37760l70930j355421k512535k775123
4730A45989163l526796m035101l074341l056509k872145k875585j614643k465069
4722A22468974j915466j097132n04461r11966m95842j070409m95821k189795j595730
4713A12192352k088540k534882j486423k239980k051032j631328j431460k170481
4705I6558226j319786k505652m73719k011624p71022j544575l82937j056902k83310
4696H6208699j147823o47153j443639l76426r96843j465778j112866p49360n46637
4687G7722174L18590L17295l01948k24105N72674L20575n08132N52p58668p79995
4677G6679012j429910j059285l33940j068324j133706p22284j327620o71607j475423
$$ plain form
4738 158425461 156232447 154844611 153440932 153003172 152632242 151276821 148764286 145989163
4730 145989163 142462367 138427266 135352925 132296416 129424271 126548686 124934043 122468974
4722 122468974 120553508 119456376 118951915 118039949 117544107 116473698 115977877 113788082 112192352
4713 112192352 110103812 107568930 106082507 103842527 101791495 100160167 98728707 96558226
4705 96558226 95238440 92732788 92259069 90247445 89476423 87931848 87548911 86492009 86208699
4696 86208699 85060876 84413723 82970084 82593658 81596815 80131037 79018171 78268811 77722174
4687 77722174 78040764 78358059 78056111 77832006 78404680 78725255 78217123 78217675 77459007 76679012
4677 76679012 75249102 74189817 73855877 72787553 71653847 70931563 69603943 68932336 67456913
4668F7456913j337457o59543j123539j25006o59393j32787j504842j17051j529619
4659F0267676r05272j042788o07929q90906n66045p31775j155747l87193o5392
4650E3914629o69246o63443j133594j57824j78283l46016n76450l91381j123719
4641D8674673K43596k49003o28882r41479k61137k60221p48722r27181m85511
4632D4416133K09870j540689l72933l77810q65209l27699m69626k47156q11269
4623C9613612M2171n56792p50872k96048p39029l20416p90813q35877j27798j283766
4613C3954372r9522p17436j251252M99157j574782K22230l32799j033133n54396
4604B9112439l37060n15274q44839j68516k43373k04796R3570m47100k44416j88400
$$ plain form
4668 67456913 66119456 65459913 64336374 64211368 63551975 63419188 61914346 61797295 60267676
4659 60267676 59362404 58319616 57711687 56820781 56254736 55522961 54367214 53980021 53914629
4650 53914629 53245383 52581940 51448346 51290522 51112239 50766223 50189773 49798392 48674673
4641 48674673 48918269 48669266 48040384 47098905 46837768 46577547 45828825 44901644 44416133
4632 44416133 44626003 43085314 42712381 42334571 41469362 41141663 40672037 40424881 39613612
4623 39613612 39655783 39098991 38348119 38052071 37313042 36992626 36201813 35365936 35238138 33954372
4613 33954372 33854850 33137414 31886162 32385319 30810537 31032767 30699968 29666835 29112439
4604 29112439 28775379 28260105 27415266 27246750 27003377 26798581 26892151 26445051 26200635 26012235
4594B6012235L05709j24767j25887p73375P09760j068099o97949J88988M47329
4585B4873944j414366L22135k88622p01523l61149K74946p28351J29168j203757
4576B0902425P19505n14863K72202r46126L37831m30642K38698n56146j18292
4567A9904592J20423l32129M0569l34571K41260n23901L92188m95714Q6492l2244
4557A9066965n10356k33368O56537n45818k66063m90327k06192l57126k3302j90047
4547A6900903n2512j89867J9403j23866J24886j64244l38990J09852M43771j036867
4537A5692469J97245L08267n88718k66276q7030K92735n67179k9171l46013k97288
4527A4309041K8717P2259J92141p49051O26121m90940j57071K07550m85624n5374
$$ plain form
4594 26012235 26317944 26193177 26067290 25293915 26003675 24935576 24237627 24426615 24873944
4585 24873944 23459578 23781713 23493091 22791568 22430419 22705365 21977014 22106182 20902425
4576 20902425 21621930 21107067 21379269 20433143 20770974 20340332 20579030 20022884 19904592
4567 19904592 20025015 19692886 19733455 19398884 19640144 19116243 19508431 19012717 19099209 19066965
4557 19066965 18556609 18323241 18979778 18433960 18167897 17677570 17471378 17114252 17090950 16900903
4547 16900903 16848391 16658524 16677927 16554061 16678947 16514703 16175713 16285565 16729336 15692469
4537 15692469 15889714 16197981 15609263 15342987 15255957 15548692 14981513 14952342 14606329 14309041
4527 14309041 14337758 14410017 14602158 13853107 14479228 13988288 13831217 14038767 13553143 13497769
4517A3497769r7892J28594k70830n2505j74061M7584K03010n30681L09000j79912
4507A2880076l07967L44310j60275k32951k01578j27884M98315k44265k90558
4498A2157223O6397n2948m4473p98340j7319O14506n09601L69177m80953K99776
4488A1603445J73681m38350r4041K02871L29799p31577K53403M87838j17218R5861
4478A1765712k50608M35596J49010K68984l83164O70265J55299K40647K68897
4469A3320638J24050J85930L88489L79255k12017Q24105O01596K9827P86411j2073
4459A6416211O03600m1669O88471O98965J49433l23265O46821J81401Q349J7659
4449A9045976m16995J25132p04325l6220L02938j50628O48882P6563M09228O07299
$$ plain form
4517 13497769 13399877 13528471 13257641 13205136 13031075 13078659 13281669 12750988 13059988 12880076
4507 12880076 12572109 12916419 12756144 12523193 12321615 12193731 12692046 12447781 12157223
4498 12157223 12223620 12170672 12126199 11327859 11310540 11925046 11415445 11784622 11303669 11603445
4488 11603445 11777126 11338776 11244735 11447606 11777405 11045828 11299231 11787069 11669851 11765712
4478 11765712 11515104 11950700 12099710 12368694 11985530 12655795 12811094 13051741 13320638
4469 13320638 13444688 13630618 14019107 14398362 14186345 15010450 15612046 15641873 16428284 16416211
4459 16416211 17019811 16978142 17666613 18365578 18515011 18191746 18838567 19019968 19028317 19045976
4449 19045976 18628981 18754113 18049788 18013568 18316506 18165878 18814760 18891323 19300551 19907850
4439A9907850K18558K08743N80151J214920m43886N34540R39579j88609J257303
4430B4229149r7021M84671J629539o78947J305252l00833P7747p26711Q8011j516533
4420B4494324j76752j293290l13902p05760m73803j334076l30881n52269n8447
4411A9255144j09518l04461n57660j54060M3880j83813K61705n72854l8674n52200
4401A7087489M56196k46152L63022k95966p03663K78491L17506q94099m90962
4392A5871862o60114j89382k83238o91997j03172q385n44059K12506n89437N47788
4382A3562372k01335m25694j55395O97627J28914j80304J10445M45699K86880
4373A4269209L46761j93333J14025N45232l33116M84455L10433k5435K81957j17123
$$ plain form
4439 19907850 20126408 20335151 20915302 22130222 21686336 22220876 23160455 22971846 24229149
4430 24229149 24132128 24616799 26246338 25567391 26872643 26571810 26649557 25922846 26010857 24494324
4420 24494324 24317572 23024282 22710380 22004620 21530817 20196741 19865860 19313591 19255144
4411 19255144 19145626 18841165 18283505 18129445 18173325 17989512 18251217 17678363 17639689 17087489
4401 17087489 17543685 17297533 17660555 17364589 16660926 16939417 17256923 16362824 15871862
4392 15871862 15211748 15022366 14739128 14047131 13943959 13935574 13391515 13604021 13014584 13562372
4382 13562372 13361037 12935343 12779948 13477575 13606489 13426185 13536630 13982329 14269209
4373 14269209 14615970 14422637 14536662 15081894 14748778 15233233 15543666 15518231 15800188 15683065
4363A5683065k85720L21401l4183K02435o68119M52117j39171L34188l88575M11549
4353A5888987n60424L80005o38265R84493n39181M83704j031521R00165J31919
4344A5999882P8404q9257M11146m20035P81133N25974m85058N06851M65987N88615
4334A8363642l17445N57869N49074O27068k91011N84067P88925R96672R43361
4325B2802222K65251J497770M18838J703515J144505R99692R96320J754238K426025
4316C4008376J153742J964391K394338J061537J942102P55686l73181j298547
4308D1608444k319891k270215k522856l167404k109506j838291k487142k166982
4300B2726157j646802j167972j084014j080204j500161q13399n62703j061229
$$ plain form
4363 15683065 15397345 15718746 15684563 15886998 15218879 15670996 15531825 15866013 15477438 15888987
4353 15888987 15328563 15708568 15070303 16054796 15515615 15999319 14967798 15867963 15999882
4344 15999882 16078286 15989029 16400175 15980140 16761273 17287247 16802189 17309040 17775027 18363642
4334 18363642 18046197 18604066 19153140 19780208 19489197 20073264 20862189 21858861 22802222
4325 22802222 23067473 24565243 24984081 26687596 27832101 28831793 29828113 31582351 34008376
4316 34008376 35162118 37126509 39520847 40582384 42524486 43280172 42906991 41608444
4308 41608444 39288553 37018338 34495482 31328078 29218572 27380281 24893139 22726157
4300 22726157 21079355 19911383 18827369 17747165 16247004 15433605 14870902 13809673
4292A3809673k66496k77775p41883l74680n00966l73021K370m76982l80413l88131
4282A0031696j89377k45754n83392m02227n4806o37489L62940l49235l73940M08159
4272G966575p04468k46432M69102l22581l45579j77111l33629L97838q03571J01675
4262F001819o2726n3971l75074r6749k36193M76088n96837R15565q92672l00944
4252D778306P01811q76889K97703j43027L15815N7984k6726J42689l76878k0055
4242D850733k90818L82880q1748j47604J39006m96770L33193k11164k60134J09327
4232D326901M3878M8934m81979L004N13337m73056N13555m83367o6660L61414
4222D305961o44500K80221K24355l11829R5463J10090J1508n6459j24288k11017
$$ plain form
4292 13809673 13543177 13265402 12523519 12148839 11647873 11274852 11277222 10800240 10419827 10031696
4282 10031696 9842319 9596565 9013173 8610946 8556140 7918651 8281591 7932356 7558416 7966575
4272 7966575 7262107 7015675 7484777 7162196 6816617 6639506 6305877 6703715 5900144 6001819
4262 6001819 5939093 5885122 5510048 5413299 5177106 5653194 5056357 5971922 5079250 4778306
4252 4778306 5480117 4603228 4900931 4757904 5073719 5131703 5104977 5247666 4870788 4850733
4242 4850733 4559915 4942795 4861047 4713443 4852449 4355679 4688872 4477708 4217574 4326901
4232 4326901 4370779 4419713 3937734 3940738 4454075 3981019 4494574 4011207 3944547 4305961
4222 4305961 3661461 3941682 4166037 3854208 3949671 4059761 4071269 4014810 3890522 3679505
4212C679505J21210L60199j67668j65572k19022J42184L40660m16863J76204N9741
4202C910578l9081l1772O894m44037L94002l72400o1302N12698o1938l17081n59357
4191B937204j21130N52425j24421K15773n34455K04574Q127m13427J97410k30988
4181B691092l0219l19466L37486N77164o70470O24606k03032k77181K6056L24414
4171C080450k35521m95169J96477n95518M32904K47122j10047m66323M27623j32409
4161B349589j29728p44203J386988r38262J66899P2468k20531N55375m24337M21620
4151B495878k75581L30614n45732J61577R2268L15913k68074l8760m38701P35805
4141B565207k43729k69080K34567k02009L86745n47061M87545j35984L25666m46417
$$ plain form
4212 3679505 3800715 4160914 3993246 3827674 3608652 3750836 4091496 3674633 3850837 3910578
4202 3910578 3871497 3839725 3846619 3402582 3796584 3424184 3362882 3875580 3813642 3496561 2937204
4191 2937204 2816074 3368499 3244078 3459851 2925396 3129970 3138097 2724670 2922080 2691092
4181 2691092 2660873 2341407 2678893 3256057 2585587 3210193 3007161 2729980 2756036 3080450
4171 3080450 2844929 2349760 2546237 1950719 2383623 2630745 2520698 2054375 2481998 2349589
4161 2349589 2219861 1475658 2862646 1924384 2091283 2163751 1943220 2498595 2074258 2495878
4151 2495878 2220297 2550911 2005179 2166756 2259024 2574937 2306863 2268103 1829402 2565207
4141 2565207 2321478 2052398 2286965 2084956 2471701 1924640 2412185 2276201 2601867 2155450
4131B155450L90862j08362P9349J13812j78153O47962n59422O8887K03803J7847
4121B832035j73104o18357P57699R5936o14398L14351K13379N2282K41042m6061
4111C054804J949k91704M23084N2070K8943n10384R40774l56217P74307k72460
4101C845166N31884J68302K08275L18995M03069L48584n8051j21915l97458R20291
4091F167142j87702L73413q02851K3240M99723m13911M09736p57357K96730o22247
4081D985916P26658m8875j04885N33929k51505J37015K49870m11306N77082L68240
4071F762139O14448K01630K00294L66121O72974L06607L91785P7984l04628M43926
4061I733280j98515K1392n25809p014j45715j52464q87651J93813o94575M17501
$$ plain form
4131 2155450 2546312 2437950 2517299 2631111 2452958 3100920 2541498 2610385 2814188 2832035
4121 2832035 2658931 2040574 2798273 2894209 2279811 2594162 2807541 2859823 3100865 3054804
4111 3054804 3056753 2765049 3188133 3240203 3269146 2758762 3699536 3343319 4117626 3845166
4101 3845166 4377050 4545352 4753627 5072622 5475691 5824275 5766224 5644309 5246851 6167142
4091 6167142 5979440 6352853 5550002 5573242 6072965 5659054 6068790 5311433 5608163 4985916
4081 4985916 5712574 5663699 5558814 6092743 5841238 5978253 6228123 5816817 6393899 6762139
4071 6762139 7376587 7578217 7778511 8144632 8817606 9124213 9515998 9593982 9289354 9733280
4061 9733280 9534765 9556157 9030348 9023334 8877619 8725155 7837504 8031317 7336742 7754243
4051G754243k21035m4162R1827k13909N23469k84613N52233M1462L99772k10695
4041H388592L65562k84517M23323K37689k30726P50842l57678j5950m44256M58425
4031I291306m42170J92478o69493j5800K57136l11788k47917L7423o55947M47707
4021G882935N621j46548M49981N6379N69394r9692K36750k34701L92615o27930
4011H484804k44510o95315K30080r92964k20352l01903j64556M0766o7203l14073
4001E754774j08657m21051M57809K28598j78882N6089j78258L48789k78697M95083
3991F175597o37236L66494J38278j14993k36696k95365j39738J58315n27927l60920
3981D525809r3217l60764j42857J71247p89050J75704l83790M60389j35870n03903
$$ plain form
4051 7754243 7533208 7489046 7580873 7366964 7890433 7605820 8158053 8199515 8599287 8388592
4041 8388592 8754154 8469637 8892960 9130649 8899923 9650765 9293087 9277137 8832881 9291306
4031 9291306 8849136 9041614 8372121 8356321 8613457 8301669 8053752 8091175 7435228 7882935
4021 7882935 7888556 7742008 8191989 8248368 8817762 8718070 8954820 8720119 9112734 8484804
4011 8484804 8240294 7544979 7775059 6782095 6561743 6259840 6095284 6136050 6068847 5754774
4001 5754774 5646117 5225066 5682875 5911473 5732591 5788680 5610422 5959211 5680514 6175597
3991 6175597 5538361 5904855 6043133 5928140 5691444 5396079 5256341 5414656 4886729 4525809
3981 4525809 4432592 4071828 3928971 4100218 3311168 3486872 3103082 3563471 3427601 2923698
3971B923698L33792r1901j35307L27630m44881p4057m08626L46721n15755k66716
3961A994598J25588M99965o13465j40868m7491n1766l42865j69615L22586R6674
3951A673341k87378j71223o23m61266L24742l78897J58529j5876K18332j79294
3941H80387m5112L19270k85412K7053k56294K4046J65122O2J42481j59363K1413
3930H33653j77789J08254j81390j14755J72498j95125K67084J15232l29443L55359
3920H53578k21943o52623O06619k08698M5560N37090p53766q1966L21533l72312
3910G3072L53524L13749l54454J42100k33745J70833r1930j17112r9875k2772
3900A33390K565L88877m32493j78261J71269Q86454m39118l44440k41796J11608
$$ plain form
3971 2923698 3257490 3165589 3030282 3357912 2913031 2838974 2430348 2777069 2261314 1994598
3961 1994598 2120186 2620151 2006686 1865818 1818327 1766561 1423696 1254081 1576667 1673341
3951 1673341 1385963 1214740 1214117 752851 1077593 698696 857225 841349 1059681 880387
3941 880387 835275 1154545 869133 896186 639892 663938 829060 829122 971603 812240 833653
3930 833653 655864 764118 582728 467973 640471 445346 712430 827662 498219 853578
3920 853578 631635 -20988 585631 376933 422493 959583 205817 123851 445384 73072
3910 73072 426596 740345 385891 527991 294246 465079 373149 256037 156162 133390
3900 133390 135955 524832 92339 -85922 85347 971801 532683 188243 -53553 58055
3890E8055K29141K13071q47612J33125k45723N63150j20464j88342N84752l10821
3880F8332m29997R62526m23347L12150n10709j97952Q6796L51650j36766p7520
3870E163q4480J61015O8240N1690M7296j3379j54401O4504k75810K9277N4756
3859d6129l73869L31070K69097r61713L77966M86330j75942j98865L91331k78125
3849a78849K25781j07594m18861M17398l50934J20050N41278Q3791p77216O60727
3839B15571l30049J30846l76796K38853K26845R4992o27376M43690j28927n7047
3829a69398r7383k97189M32102K8450k41899n24810P12876j39898K6342O53646
3819C82839n57597k05979P60890m12847K36714l45487J37060K5678J7774m8959
$$ plain form
3890 58055 287196 500267 -347345 -214220 -459943 103207 -17257 -205599 379153 68332
3880 68332 -361665 600861 177514 489664 -21045 -218997 -132201 219449 82683 5163
3870 5163 -79317 81698 149938 201628 248924 235545 81144 145648 -130162 -100885 -46129
3859 -46129 -419998 -88928 180169 -781544 -403578 82752 -93190 -292055 99276 -178849
3849 -178849 46932 -60662 -479523 -62125 -413059 -293009 248269 332060 -445156 215571
3839 215571 -114478 16368 -360428 -121575 105270 200262 -427114 16576 -112351 -169398
3829 -169398 -266781 -563970 -131868 -103418 -345317 -870127 -157251 -297149 -270807 382839
3819 382839 -174758 -380737 380153 -32694 204020 -141467 -4407 21271 39045 -9914
3809i914l92483r7703N9833L65363j170l20106O13031n88653j64981K56193m5820
3798c26410Q763J70641n97536O91225k46602J11506K68420l48085p6030K51783
3788i2325J02919k40723J68787j77L63R4487l31356q2296R0226o37361J003561
3777G6105K8865j85546l5377n24745Q95557r56445M64350P5946J5494K2714k43267
3766c66349Q00837o83804M64845l74240k27304N5638J5363p5577n6372R0541M34542
3755G8120o779l32721k57110j77395N93595m03354J72237Q5448J24116J55613
3745C1770j75112k34945M817M98552n41092M29879K33684m75184m6373k72416
3735e46420L59074K95169n30129J47880K31667o683o9192K21691r30000Q55204
$$ plain form
3809 -9914 -402397 -500100 -440267 -74904 -76074 -396180 216851 -371802 -536783 -280590 -326410
3798 -326410 -317647 -147006 -744542 -53317 -299919 -188413 80007 -268078 -344108 -92325
3788 -92325 10594 -230129 -61342 -61519 -61156 33331 -298025 -380321 -290095 -927456 76105
3777 76105 104970 -80576 -115953 -640698 254859 -701586 -237236 -161290 -145796 -123082 -366349
3766 -366349 434488 -249316 215529 -158711 -386015 -330377 -315014 -390591 -446963 -356422 78120
3755 78120 71341 -261380 -518490 -695885 -102290 -505644 -333407 -247959 -123843 31770
3745 31770 -143342 -378287 -373470 125082 -416010 13869 247553 -227631 -274004 -546420
3735 -546420 -187346 107823 -422306 -274426 -42759 -49442 -118634 103057 -826943 28261
3725B8261o43029j03350N22035l60701J75799m04855L65986n5402k32771P55284
$$ plain form
3725 28261 -614768 -718118 -196083 -556784 -380985 -785840 -419854 -475256 -708027 47257
$$ [...]
##END NTUPLES=NMR SPECTRUM
##END=
