##TITLE=abcd
##JCAMPDX= 6.0         $$ Bruker NMR JCAMP-DX V2.0
##DATA TYPE= NMR SPECTRUM
##DATA CLASS= NTUPLES
##ORIGIN= UXNMR, Bruker Analytische Messtechnik GmbH
##OWNER= root
$$ XWIN-NMR		Version 3.5
$$ Fri Nov 21 11:59:06 2025 Russian Standard Time (UT+4h)  servis@DPX200
##.OBSERVE FREQUENCY= 200.131235884673
##.OBSERVE NUCLEUS= ^1H
##.ACQUISITION MODE= SIMULTANEOUS
##.ACQUISITION SCHEME= undefined
##.AVERAGES= 32
##.DIGITISER RES= 18
##SPECTROMETER/DATA SYSTEM= spect
##.PULSE SEQUENCE= zg
##.SOLVENT NAME= CDCl3
##.SHIFT REFERENCE= (INTERNAL, CDCl3, 0, 16.4885)
##AUDIT TRAIL= $$ (NUMBER, WHEN, WHO, WHERE, WHAT)
$$ ##TITLE= Audit trail, XWIN-NMR		Version 3.5
$$ ##JCAMPDX= 5.01
$$ ##ORIGIN= Bruker BioSpin GmbH
$$ ##OWNER= servis
$$ F:\spectra/data/av/nmr/H1/1/pdata/1/auditp.txt
$$ ##AUDIT TRAIL=  $$ (NUMBER, WHEN, WHO, WHERE, WHAT)
(   1,<2025-11-21 11:57:38.71 +0400>,<servis>,<DPX200>,
      <created by zg, POWCHK disabled, PULCHK disabled
       configuration hash MD5:
       00 E9 B6 7A A2 85 ED C7 34 08 36 98 17 FE 4E 26
       data hash MD5: 32K
       47 BE 88 AF CA E1 DD 89 E8 E5 0A BA FD 3F 7F D4>)
(   2,<2025-11-21 11:58:45.56 +0400>,<servis>,<DPX200>,
      <Start of raw data processing
       efp BC_mod = 2 LB = 0.05 FT_mod = 6 PKNL = 1 PHC0 = -261.6425 PHC1 = 6.301564 SI = 16K 
       data hash MD5: 16K
       BA 95 20 76 F4 51 21 86 13 AB 1E 33 F0 09 B7 EB>)
$$ ##END=
$$ 
$$ hash MD5
$$ 84 71 51 AC 3A 7C 61 B4 40 E0 F8 5A 62 16 A2 FE
##$RELAX= 
##$RELAX= 
##$RELAX= 
##$RELAX= 
##$RELAX= 
##$RELAX= 
##$RELAX= 
##$RELAX= 
$$ Bruker specific parameters
$$ --------------------------
##$DU= <F:\spectra>
##$EXPNO= 1
##$NAME= <H1>
##$PROCNO= 1
##$TYPE= <nmr>
##$USER= <av>
##$AMP= (0..31)
100 100 100 100 100 100 100 100 100 100 100 100 100 100 100 100 100 100 
100 100 100 100 100 100 100 100 100 100 100 100 100 100 
##$AQSEQ= 0
##$AQ_mod= 1
##$AUNM= <au_zg>
##$AUTOPOS= <>
##$BF1= 200.13
##$BF2= 200.13
##$BF3= 200.13
##$BF4= 200.13
##$BF5= 500.13
##$BF6= 500.13
##$BF7= 500.13
##$BF8= 500.13
##$BYTORDA= 1
##$CFDGTYP= 0
##$CFRGTYP= 5
##$CHEMSTR= <none>
##$CNST= (0..31)
1 1 145 1 1 1 1 1 1 1 1 1 1 1 1 1 1 1 1 1 1 1 1 1 1 1 1 1 1 1 1 1 
##$CPDPRG= <>
##$CPDPRG1= <>
##$CPDPRG2= <>
##$CPDPRG3= <>
##$CPDPRG4= <mlev>
##$CPDPRG5= <mlev>
##$CPDPRG6= <mlev>
##$CPDPRG7= <mlev>
##$CPDPRG8= <mlev>
##$CPDPRGB= <>
##$CPDPRGT= <>
##$D= (0..31)
0 2 0 0 0 0 0 0 0 0.06 0 0 0 0 0 0 0.0002 0 0 0 0 0 0 0 0 0 0 0 0 0 0 
0 
##$DATE= 1763711858
##$DBL= (0..7)
120 120 120 120 120 120 120 120 
##$DBP= (0..7)
150 150 150 150 150 150 150 150 
##$DBP07= 0
##$DBPNAM0= <>
##$DBPNAM1= <>
##$DBPNAM2= <>
##$DBPNAM3= <>
##$DBPNAM4= <>
##$DBPNAM5= <>
##$DBPNAM6= <>
##$DBPNAM7= <>
##$DBPOAL= (0..7)
0.5 0.5 0.5 0.5 0.5 0.5 0.5 0.5 
##$DBPOFFS= (0..7)
0 0 0 0 0 0 0 0 
##$DE= 6
##$DECBNUC= <off>
##$DECIM= 32
##$DECNUC= <off>
##$DECSTAT= 4
##$DIGMOD= 1
##$DIGTYP= 9
##$DL= (0..7)
0 120 120 120 120 120 120 120 
##$DP= (0..7)
150 150 150 150 150 150 150 150 
##$DP07= 0
##$DPNAME0= <>
$$ [...]
##$SUBNAM4= <"">
##$SUBNAM5= <"">
##$SUBNAM6= <"">
##$SUBNAM7= <"">
##$SUBNAM8= <"">
##$SUBNAM9= <"">
##$SW= 20.6817932712277
##$SWIBOX= (0..15)
0 0 3 0 0 0 0 0 0 0 0 0 0 0 0 0 
##$SW_h= 4139.07284768212
##$TD= 32768
##$TD0= 1
##$TE= 0
##$TE2= 300
##$TE3= 300
##$TEG= 300
##$TL= (0..7)
0 120 120 120 120 120 120 120 
##$TP= (0..7)
150 150 150 150 150 150 150 150 
##$TP07= 0
##$TPNAME0= <>
##$TPNAME1= <>
##$TPNAME2= <>
##$TPNAME3= <>
##$TPNAME4= <>
##$TPNAME5= <>
##$TPNAME6= <>
##$TPNAME7= <>
##$TPOAL= (0..7)
0.5 0.5 0.5 0.5 0.5 0.5 0.5 0.5 
##$TPOFFS= (0..7)
0 0 0 0 0 0 0 0 
##$TUNHIN= 0
##$TUNHOUT= 0
##$TUNXOUT= 0
##$USERA1= <user>
##$USERA2= <user>
##$USERA3= <user>
##$USERA4= <user>
##$USERA5= <user>
##$V9= 5
##$VALIST= <valist>
##$VCLIST= <CCCCCCCCCCCCCCC>
##$VD= 0
##$VDLIST= <DDDDDDDDDDDDDDD>
##$VPLIST= <PPPPPPPPPPPPPPP>
##$VTLIST= <TTTTTTTTTTTTTTT>
##$WBST= 1024
##$WBSW= 30
##$XGAIN= (0..3)
0 0 0 0 
##$XL= 0
##$YL= 0
##$YMAX_a= 3927528
##$YMIN_a= -2554341
##$ZGOPTNS= <>
##$ZL1= 120
##$ZL2= 120
##$ZL3= 120
##$ZL4= 120
##$ABSF1= 0
##$ABSF2= 0
##$ABSG= 0
##$ABSL= 0
##$ALPHA= 0
##$AQORDER= 0
##$ASSFAC= 0
##$ASSFACI= 0
##$ASSFACX= 0
##$ASSWID= 0
##$AUNMP= <proc_1d>
##$AZFE= 0.1
##$AZFW= 0.1
##$BCFW= 0
##$BC_mod= 2
##$BYTORDP= 0
##$COROFFS= 0
##$CY= 18.4799938201904
##$DATMOD= 1
##$DC= 0
##$DFILT= <>
##$DTYPP= 0
##$F1P= 9.9274215381318
##$F2P= -0.165520771350173
##$FCOR= 1
##$FTSIZE= 16384
##$FT_mod= 6
##$GAMMA= 0
##$GB= 0
##$INTBC= 1
##$INTSCL= 4.127829e-11
##$ISEN= 128
##$LB= 0.05
##$LEV0= 0
##$LPBIN= 0
##$MAXI= 10000
##$MC2= 0
##$MEAN= 0
##$ME_mod= 0
##$MI= 50
##$NCOEF= 0
##$NC_proc= -2
##$NLEV= 6
##$NOISF1= 3.799351
##$NOISF2= 2.8
##$NSP= 0
##$NTH_PI= 0
##$NZP= 0
##$OFFSET= 16.48848
##$PC= 4
##$PHC0= -261.6425
##$PHC1= 6.301564
##$PH_mod= 1
##$PKNL= yes
##$PPARMOD= 0
##$PSCAL= 4
##$PSIGN= 0
##$REVERSE= no
##$SF= 200.130005582386
##$SI= 16384
##$SIGF1= 3
##$SIGF2= 2
##$SINO= 400
##$SIOLD= 16384
##$SREGLST= <1H.CDCl3>
##$SSB= 0
##$STSI= 16384
##$STSR= 0
##$SW_p= 4139.07284768211
##$SYMM= 0
##$S_DEV= 0
##$TDeff= 32768
##$TDoff= 0
##$TI= <>
##$TILT= no
##$TM1= 0
##$TM2= 0
##$TOPLEV= 0
##$USERP1= <user>
##$USERP2= <user>
##$USERP3= <user>
##$USERP4= <user>
##$USERP5= <user>
##$WDW= 1
##$XDIM= 16384
##$YMAX_p= 482727319
##$YMIN_p= -460427
$$ End of Bruker specific parameters
$$ ---------------------------------
##NTUPLES= NMR SPECTRUM
##VAR_NAME=  FREQUENCY,     SPECTRUM/REAL,   SPECTRUM/IMAG
##SYMBOL=    X,             R,               I
##VAR_TYPE=  INDEPENDENT,   DEPENDENT,       DEPENDENT
##VAR_FORM=  AFFN,          ASDF,            ASDF
##VAR_DIM=   16384,         16384,           16384
##UNITS=     HZ,            ARBITRARY UNITS, ARBITRARY UNITS
##FACTOR=    0.252644378177508, 1,           1
##FIRST=     3299.83951724647, 0,            0
##LAST=      -839.233330435636, 0,           0
##MIN=       -839.233330435636, -460427,     0
##MAX=       3299.83951724647, 482727319,    0
$$ Real data points
##PAGE= N=1
##DATA TABLE= (X++(R..R)), XYDATA
$$ [...]
12533c62659J348K901K918j0612J2588k5063P633m509Q756M934Q148j0934n457
12520c70008k108P021L063j0172K616J2932n027q90q225J3143p047l21l093J5472
12506c52644j9287J3723j5475L759M911r303J6428j3004J9543n695q507j869K663
12493c64757o056O954m821R715n750l808J3099p143L950r49l359j0280Q706p515
12479c72014L029j330P78M239P169p351J0327j77m577j334r50o944N375l316M349
12464c62727m278p172O57J0992q530P806P328j892j0937j085l376o798K653O951
12450c70408l438J7100r154N631j4038J1692m859K525L17Q40j295OO243j647k312
12435c62797n547R510j2455J0182k177j840k460L87Q245j2196n430P262J237j2360
$$ y = [-362659, -361311, -358410, -355492, -366104, -353516, -378579, -370946, -375455, -366699, -361765, -353617, -364551, -370008, -372116, -365095, -362032, -372204, -369588, -356656, -361683, -362573, -370798, -357655, -364702, -365023, -368116, -352644, -371931, -358208, -373683, -369924, -365013, -374316, -357888, -370892, -351349, -357044, -365551, -367420, -364757, -370813, -363859, -368680, -358965, -364715, -368523, -355424, -362567, -358617, -359566, -362925, -373205, -364499, -372014, -368985, -370315, -369537, -365298, -358129, -365480, -355153, -355330, -359907, -361241, -362191, -369135, -363760, -367076, -362727, -367005, -374177, -373520, -362528, -371058, -363252, -355924, -357816, -368753, -369838, -373214, -380012, -377359, -370408, -373846, -356746, -365900, -360269, -374307, -362615, -367474, -364949, -364632, -363792, -365087, -365081, -358838, -360485, -362797, -368344, -358834, -371289, -361107, -363284, -365124, -367584, -367197, -358952, -371148, -376578, -369316, -368079, -380439]
12421c80439R391P024m86J969j4944M363J4593r142K1057k1494O161J107k856
12408c63696j861o96o034q01K0760j9334J798O978j1064N249n856k038J8789r644
12394c67450P28k474J787M250L032r263J429n633R435O676r887L623k243J3854
12380c52136j6417o79J567L002J0463j0647L645j2048J0519Q36j7245M409N483
12367c69248M802j4806J7314j2108q931R244N949r308P244m20q070O18M582P985
12353c65153O26O565j5851J593J5734j3899l133L7K42K248J110m208p817J4100
12339c67806j1231J0458M26K31J0734p53j6146J0152m977l231j480N246j036m555
12325c73968n902Q621l731K779R492j2008M776O908q650L939j4026K0273n942
$$ y = [-380439, -371048, -364024, -364510, -362541, -377485, -373122, -358529, -367671, -346614, -368108, -361947, -360840, -363696, -365557, -366253, -372287, -373088, -352328, -371662, -369864, -362886, -373950, -368701, -374557, -376595, -357806, -367450, -366722, -369196, -367409, -363159, -360127, -369390, -367961, -373594, -364159, -357483, -367370, -363747, -365990, -352136, -368553, -369232, -367665, -364663, -354200, -364847, -361202, -373250, -362731, -361895, -379140, -374731, -369248, -364446, -379252, -361938, -374046, -382977, -373733, -367784, -377092, -369848, -370268, -378338, -377720, -373138, -365153, -364527, -357962, -373813, -372220, -356486, -370385, -373518, -373481, -373239, -370991, -369881, -374089, -381906, -367806, -379037, -368579, -368153, -367922, -357188, -357941, -374087, -363935, -368912, -372143, -373623, -368377, -369413, -373968, -379870, -371249, -374980, -372201, -362709, -374717, -369941, -363033, -371683, -367744, -381770, -361497, -367439]
12312c67439j696k101r070M908J0252j9003Q430L941J4639j0815r99p702M886
12299c71769j0013J1907K756J737m167P710r543L657k109j2035J6544n291n427
12286c76043N958Q875k492K514j0150N500j2290L56J7952l1j2588K331n05P394
12272c63219j897j9276J3915n65k426k07n583M477L263r988R968P772m490M44
12258c67812K101K17j1950N783N583j4293J1035O801j2932P357j3770J2078n840
12245c75642Q492j234o840K156N401j5028J4174q555l515J2195j3237J3329j1770
12232c80074j72N844k838Q419k870l43o366O287J619o895j216J561P493j969l082
12217c74602M910m757j72L327r715P46J2145p666k071R889j0576R756l915L062
$$ y = [-367439, -369135, -371236, -380306, -375398, -365146, -384149, -375719, -371778, -357139, -367954, -368953, -376655, -371769, -381782, -369875, -367119, -365382, -369549, -361839, -371382, -367725, -369834, -381869, -365325, -370616, -376043, -370085, -361210, -363702, -361188, -371338, -365838, -378128, -377772, -359820, -359851, -372439, -370108, -370613, -363219, -365116, -384392, -370477, -371042, -373468, -373675, -379258, -374781, -371518, -381506, -371538, -363766, -368256, -367812, -365711, -365494, -377444, -371661, -366078, -380371, -369336, -362535, -375467, -368110, -381880, -369802, -375642, -367150, -368384, -375224, -373068, -367667, -382695, -368521, -377076, -380591, -368396, -381633, -368304, -380074, -380246, -374402, -377240, -368821, -371691, -372034, -378400, -372113, -370494, -377389, -378605, -377044, -369551, -371520, -374602, -369692, -374449, -374621, -371294, -381009, -380263, -368118, -375784, -377855, -367966, -378542, -368786, -372701, -369639]
12203c69639n10k4127K3621l320P508j1439k344J4701N159j9438N396j3356J4765
12190c73023m98M70M88K125r155R285p355Q21J95J4398o297K550k1980J1287j612
12175c78301J4274o925K0743j1810j187l82p63K382k0756J64k898J2458k994k393
12161c78388l638K450j236L375P056k317L449j1971n494J0033R278o072j987J3331
12147c62131M601k6296O166l577Q141k557j990o870Q363R383j900M711j4757o81
12133c79394q322R38J0046J1994J0148j0640N268P210j2538j4324j109P231m638
12120c78130M140P769j0029O426j0959J4835j4484j4173J2491J6903l884L998
12108c65097o195k519J844p350l371M233L409L323j3285J2179p484l133K0314
$$ y = [-369639, -370149, -394276, -370655, -373975, -366467, -377906, -380250, -365549, -360390, -379828, -374432, -387788, -373023, -373521, -373051, -372563, -370438, -379593, -370308, -377663, -376842, -376647, -362249, -368546, -365996, -387976, -376689, -378301, -364027, -370952, -350209, -362019, -363206, -363588, -364351, -361969, -382725, -382561, -385459, -373001, -375995, -378388, -382026, -379576, -380812, -377437, -370381, -372698, -369249, -381220, -386714, -376681, -367403, -373475, -375462, -362131, -357530, -383826, -377660, -381237, -373096, -375653, -377643, -384513, -376150, -366767, -368667, -363956, -378713, -379394, -387716, -386778, -376732, -364738, -354590, -365230, -359962, -352752, -365290, -379614, -380723, -373492, -378130, -373990, -366221, -376250, -369824, -380783, -365948, -380432, -394605, -382114, -365211, -369095, -365097, -371292, -373811, -371967, -379317, -382688, -378455, -375046, -371723, -385008, -372829, -380313, -383446, -363132]
12095c63132j1926Q331j0379o410k339J6944n951p687J271j0808O291K0201K22
12082c65372m354j0694R285r057K1970o162Q665R442N074p254k0627l879n491
12069c78454p290J0823J1187j2225j3762J5403O973r400J608j4741J2524L240
12057c74114p424J094m915J799j0188R788J8430o278Q748p834L216o875p496J2192
12043c69857j2918P979r510m083L190J6929j6849K0010r399J0727j4769L617N020
12030c69913l303J412M426j1219K963k34J330l932R295j6808j903Q087J444j0759
12016c89114L764Q932J5496j8727M486j4378J1358Q517l791o032Q323j2960l042
12003c87168J4480Q546l726J9762O489j6604n827j1639J1186m469o646J951n750
$$ y = [-363132, -375058, -366727, -377106, -383516, -385855, -368911, -374862, -382549, -381278, -392086, -385795, -365594, -365372, -369726, -380420, -371135, -380192, -358222, -364384, -355719, -346277, -341203, -348457, -369084, -372963, -378454, -385744, -374921, -363734, -375959, -389721, -374318, -367345, -376745, -375137, -389878, -377354, -374114, -381538, -380444, -385359, -383560, -393748, -383960, -365530, -371808, -363060, -370894, -367678, -374553, -382049, -369857, -382775, -374796, -384306, -388389, -385199, -368270, -385119, -365109, -374508, -363781, -378550, -374933, -369913, -373216, -371804, -367378, -378597, -375634, -375868, -374538, -378470, -369175, -385983, -387886, -379799, -378355, -389114, -385350, -376418, -360922, -379649, -375163, -389541, -378183, -369666, -373457, -379489, -371166, -384126, -387168, -372688, -364142, -367868, -348106, -341617, -358221, -364048, -375687, -364501, -368970, -375616, -373665, -379415]
11990c79415N165l067J3l504l971l237O901o2M453N033j5849p923J6203K370j3272
11975c90162J2834j928P515j0446J8733j7902o778K0231l57r154J6255j3906J2
11962c75053j868K142N816j3721M891q227J8716j4411J2915l242L278n053o043
11949c79860q53R409J682Q7R868n785o435j0846j694O460J2675j0245l894j389
11935c80820J256J12o904M561M578m596J8316m890p934P37L634j1955J0042J1088
11921c62775k9470J4975M61L726q838R267R673j5993K51J5240r559j0913R324
11908c74631k842K749P232j1784M123j507P450q904r034P702r080J7990j9738
11895c90274K5413r698j2939P222o309J0771n42m677K771N720j0306Q035k634
$$ y = [-379415, -374250, -377317, -377304, -380808, -384779, -388016, -381115, -381177, -376724, -371691, -387540, -395463, -379260, -376890, -390162, -377328, -379256, -371741, -382187, -363454, -381356, -388134, -367903, -368260, -377414, -361159, -375065, -375053, -376921, -374779, -368963, -382684, -377793, -386020, -367304, -381715, -368800, -372042, -368764, -373817, -379860, -380713, -371304, -369622, -369535, -359667, -365452, -371887, -382733, -384427, -377967, -365292, -375537, -379431, -380820, -379564, -379452, -386356, -381795, -377217, -381813, -363497, -368387, -376321, -375584, -371950, -383905, -373863, -362775, -392245, -377270, -376809, -373083, -381921, -372654, -362981, -378974, -378723, -363483, -373042, -383955, -374631, -377473, -374724, -367492, -379276, -375153, -376660, -369210, -378114, -387148, -379446, -388526, -370536, -390274, -364861, -374559, -387498, -380276, -386585, -375814, -376356, -381033, -378262, -372542, -382848, -374813, -377447]
11882c77447K993L304l21j2806J7216p352j1383J2128k973n96K924M660j893o459
11868c78005N236o323J074J964o884M80Q356J1924j2845O65l234p584J4029q556
11854c79703K108j086K561K786p916j421j424M425k200J330P37r188J8056j725
11840c72660k175p191o314J4187M01q303Q520n551O788J698j4163K923J0771l951
11826c75020n644n305Q763J54j9n816o44n327J4965p197k829K7131j1663n590
11812c74041j0504O947J2401j1006o03O592l283o973J992j620k48J4160J440r873
11798c74619m023j963L817Q772k445k209r357L280J1055j1009J3Q124j780P730
11784c64614j2492N8q146O471J0962j5051J1871o831L941O648j6711Q497K488
$$ y = [-377447, -374454, -371150, -371471, -384277, -367061, -374413, -385796, -373668, -376641, -377237, -374313, -369653, -371546, -378005, -372769, -379092, -378018, -376054, -382938, -382458, -374102, -362178, -375023, -374358, -377592, -385176, -371147, -379703, -377595, -378681, -376120, -373334, -381250, -382671, -384095, -379670, -381870, -380540, -379803, -388991, -370935, -372660, -374835, -382026, -388340, -374153, -373752, -382055, -373535, -379086, -372298, -370600, -384763, -381840, -371069, -375020, -380664, -385969, -377206, -377052, -377071, -382887, -383531, -388858, -373893, -381090, -383919, -356788, -368451, -374041, -384545, -377598, -365197, -376203, -376806, -370214, -373497, -380470, -378478, -380098, -380346, -366186, -364746, -374619, -378642, -380605, -376788, -368016, -370461, -372670, -382027, -378747, -367692, -378701, -378688, -370564, -372344, -364614, -377106, -377048, -385194, -378723, -367761, -382812, -370941, -377772, -373831, -367183, -383894, -375397, -372909]
11771c72909k6806K9410j0862j040J535P212p863M649M282M581J984r129N035
11758c69921j7288J2922L188j083r285J940J6940q947J030k068q972J5790n362
11745c71116m709j815Q303k513p722K817n33k661J5430j1184Q97K037j26n466
11731c78361L855J341p450J140j857p009K0546j4471R348Q24J48j9962K3621r25
11717c69212j0193k296r453J4750m090P273q158P756J395j1136M260m38L482Q987
11703c67073j3914K154m818Q528p716J0885j7265J7939j1270P121j914R361k2935
11690c90917R910M288p821J0466j3423l154J2438n676J2862j5728M718l660R037
11677c76660M748r477N848j0165P455l021m405p40L959N644j8099K1575m640j0526
$$ y = [-372909, -399715, -370305, -381167, -382207, -380672, -373460, -381323, -376674, -372392, -367811, -365827, -374956, -369921, -387209, -374287, -371099, -372182, -381467, -379527, -362587, -371534, -370504, -372572, -381544, -365754, -371116, -375825, -377640, -369337, -371850, -379572, -376755, -377288, -379949, -364519, -375703, -374806, -372769, -372895, -378361, -374506, -373165, -380615, -379475, -381332, -388341, -367795, -382266, -372918, -372094, -371946, -391908, -368287, -369212, -379405, -381701, -391154, -376404, -380494, -373221, -381379, -373623, -372228, -383364, -379104, -379542, -376060, -367073, -380987, -378833, -383651, -375123, -382839, -371954, -389219, -371280, -382550, -375429, -377343, -367982, -390917, -381007, -376719, -384540, -374074, -387497, -390651, -378213, -383889, -371027, -386755, -382037, -385697, -376660, -371912, -381389, -375541, -385706, -378251, -381272, -385677, -386417, -382458, -376814, -394913, -373338, -377978, -388504]
11663c88504M109J6941K018k3016k841J3084M169k0462K218J4372l271m445j540
11650c87168j342M022J876j28m442l499j58J2956k387j1392P053m073J782L453
11636c83447J728P47L802q983O237o81R34P598J348L944j5366n722L80Q421k140
11621c81200j7399K7552m371K619k455m850M444o631P573p77p492j261o625J748
11607c89125J1907k47j7743J2420J6237j7754L499M479L013r116O751j1045J1530
11594c75194r922j1386J4514P472j0080O051R02j4146K6523j2693O486j424k326
11581c75223k831K648j2479J2890q04o264N402J546l849j4860K746N170M238l505
11567c85175j263j2501Q781J1045Q634j7171qJ0385J033J785o605k70M841j0910
$$ y = [-388504, -384395, -367454, -365436, -388452, -391293, -378209, -374040, -394502, -392284, -377912, -381183, -385628, -387168, -388510, -384488, -382612, -382740, -387182, -390681, -390839, -377883, -380270, -391662, -384609, -388682, -386900, -383447, -381719, -380972, -377170, -386153, -379916, -380597, -379663, -372065, -370717, -366773, -382139, -387861, -387481, -379060, -381200, -398599, -371047, -375418, -372799, -375254, -380104, -375660, -382291, -374718, -375495, -382987, -384248, -390873, -389125, -377218, -377465, -395208, -382788, -366551, -384305, -380806, -376327, -373314, -382430, -375679, -386724, -375194, -385116, -396502, -381988, -374516, -384596, -378545, -377643, -391789, -365266, -377959, -371473, -372897, -375223, -378054, -375406, -387885, -374995, -375799, -382063, -376661, -375115, -378964, -393824, -391078, -385908, -381670, -385175, -386438, -398939, -390158, -379113, -370479, -387650, -387658, -377273, -376240, -374455, -381060, -381330, -376489, -387399]
11553c87399J4041q338J4122j0332J0516j2085l419Q696n243o626J4325r698M390
11540c77050j524m461J7829j5314k777K297O25J3465L51n010j2367M837k069J3014
11526c68154j9043j023o036J3287K373o32j518n187k927R11o214O970O061n656
11512c86788J3827r216p155P110m199O651J18n697Q431j977K915j2139m688P581
11498c85226k422J2316j0874J269L231O309q995l896P78M505j2657J2168q03M027
11484c80270o20m177j853L146p193J1443l772L193j2542Q814p498J4381j012k3482
11470d01442J8239j472q607M586J5552j8443J94R311j0459M810O476l155p483
11457c91893J5518M531j9101m650J6558P93J526p267O405M340l503Q50j4447R191
$$ y = [-387399, -373358, -381696, -367574, -377906, -367390, -379475, -382894, -374198, -379441, -386067, -371742, -381440, -377050, -378574, -383035, -365206, -380520, -383297, -381000, -380375, -366910, -366559, -371569, -383936, -379099, -381168, -368154, -387197, -388220, -394256, -380969, -378596, -379228, -380746, -385933, -388860, -387949, -394163, -387193, -381132, -386788, -372961, -382177, -389332, -382222, -386421, -379770, -379652, -385349, -376918, -378895, -375980, -388119, -392807, -385226, -387648, -375332, -386206, -384937, -381706, -375397, -384392, -388288, -387510, -383005, -395662, -383494, -384297, -380270, -380890, -385067, -386920, -383774, -390967, -379524, -383296, -380103, -392645, -383831, -391329, -376948, -377960, -401442, -383203, -384675, -393282, -388696, -373144, -391587, -391393, -382082, -392541, -387731, -381255, -384410, -391893, -376375, -371844, -390945, -395595, -379037, -378244, -376718, -383985, -377580, -373240, -376743, -375893, -390340, -381149]
11443c81149q863J4899j8596N636L091N265j235k077J0785j0343P788J040p196
11430c80955n756m380J683K043K15K889r88J481J15l211K593M169k171j0151J1924
11415c80500L55M892j2998L500O46N564q83q385K281K711j1921J2164J595M350
11401c76629j9948J9443p28j9458J1986J1214j0354J145j339m681O051j0368J5552
11388c78114p64N868j5346P283l87n56p422l836N148J623J9239q281n238j855
11374c82638M160n741R728j2722O795M502o32j4029J909J1741o408L388k052o363
11360c88362l171J2369R72j1013p47R705l092q931J0788k523m8L095P916j704
11346c74746n258q250J6062r645n375K312P476k4018K5805j1318Q372r524K824
$$ y = [-381149, -390012, -375113, -393709, -388073, -384982, -379717, -380952, -383029, -372244, -382587, -374799, -373759, -380955, -386711, -391091, -389408, -387365, -387150, -384261, -385249, -383768, -383653, -386864, -384271, -380102, -382273, -392424, -380500, -380145, -375253, -388251, -384751, -384105, -378541, -379424, -387809, -385528, -382817, -394738, -382574, -380979, -376629, -396577, -377134, -377862, -397320, -385334, -374120, -384474, -383329, -384668, -389349, -383298, -393666, -378114, -378878, -373010, -388356, -381073, -381460, -382016, -389438, -393274, -388126, -386503, -367264, -375545, -380783, -382638, -378478, -384219, -374491, -387213, -380418, -375916, -376548, -390577, -388668, -376927, -383335, -379947, -381999, -388362, -391533, -379164, -378192, -389205, -389952, -380247, -383339, -392270, -381482, -384005, -384053, -380958, -373042, -374746, -380004, -388254, -372192, -381837, -387212, -384900, -377424, -401442, -375637, -386955, -378583, -388107, -385283]
11333c85283P821m953p048P148P386m303J048n666J5854n287q385o184O132K493
11319c79227L204m740k493l44j209O499m576j4023Q161Q845n60M446n452n803
11305c87272P995R6q65J788L042M041l650j5585K4833j4779J139n199J0714r912
11291c83614K201Q527j556j4226M60P231j843K297j034j693J515Q858j1844P96
11277c83925R674j5427J2759p07M073k967n426j463J4123q941O48R76J0049j9005
11263c85559J562m439K595J20R719O090K225k131j3791l05J4353l086L302R279
11249c60066q232o775L238Q15M875j256J9760l087p13J2625K4196L1067M4980
11236b38573K1067p353l1457m8642j7506j8008m753j6267J608j3824Q075k297
$$ y = [-385283, -377462, -382415, -389463, -382315, -374929, -379232, -378184, -383850, -367996, -373283, -381668, -387852, -381720, -379227, -376023, -380763, -383256, -383600, -384809, -378310, -382886, -396909, -388748, -379903, -380463, -376017, -381469, -387272, -379277, -379181, -380046, -378258, -375216, -371175, -374825, -390410, -365577, -380356, -379217, -384416, -373702, -383614, -381413, -372886, -374442, -388668, -388208, -380977, -382820, -380523, -381557, -383250, -381735, -372877, -384721, -383925, -374251, -389678, -376919, -377626, -373553, -376520, -381946, -383409, -369286, -378227, -377579, -376603, -366554, -385559, -383997, -388436, -385841, -385721, -376002, -369912, -367687, -369818, -383609, -383914, -369561, -372647, -369345, -360066, -368298, -375073, -371835, -371020, -366145, -367401, -347641, -350728, -351441, -338816, -314620, -283553, -238573, -217506, -224859, -256316, -304958, -322464, -340472, -345225, -361492, -359884, -373708, -365633, -367930]
11224c67930m469r879R793J4691p757k4471J4918l391p356R640l653J2316j0455
11211c78003M940k030j4150M900Q173r963J1343o18q090O197o969J8328j2837
11198c78779j252M771k386P182m100L679k716j1412O827n813N863q005j0409J4716
11184c81834j249n568Q549K848l254J050m990o5K788K817j0526j80l094J6681
11170c76027Q763k0171R701k41j0534k541N146K536J1449j5701J3672K056M683
11157c67209q911j553M781j3115R493j5563J7762m108j0671J1271l662K565p207
11144c86127Q85Q668j394o832P731R09n887N834L944j4906M647M443L309J736
11130c73040j9601J7036N12M315k3288J6480k314J999K471j3159J2755K46j3280
$$ y = [-367930, -372399, -382278, -372485, -357794, -365551, -390022, -375104, -378495, -385851, -376211, -379864, -367548, -378003, -373063, -375093, -389243, -384343, -376170, -386133, -374790, -375408, -383498, -377301, -384270, -365942, -378779, -380031, -375260, -377646, -370464, -374564, -370885, -373601, -385013, -378186, -383999, -378136, -386141, -396550, -381834, -383083, -388651, -380102, -377254, -380508, -379458, -384448, -384513, -381725, -378908, -389434, -389614, -392708, -376027, -367264, -387435, -377734, -377975, -388509, -391050, -385904, -383368, -371919, -387620, -373948, -371892, -367209, -376120, -377673, -372892, -386007, -376514, -392077, -374315, -378423, -389094, -377823, -381485, -378920, -386127, -385242, -376574, -377968, -384800, -377069, -376160, -382047, -376213, -372269, -387175, -382528, -378085, -374776, -373040, -392641, -375605, -375093, -370778, -394066, -377586, -379900, -377901, -375430, -388589, -375834, -375588, -388868]
11117c88868Q647K726m22p18J3232j2351k773L899J362r895J744K081J3520j3267
11103c81083p23J802M108j534j6586N133J5370o119J347L34j2286J2026M132K401
11089c71678j372L649j3371J538N034O822q483q594o692J2234M6O487j2407N893
11075c80894J5154j0888q303O836J213j6895K71K2108k929O94n057p099O085n18
11061c80222o840P24J656L544M075n797r000J5560l136N370m921n40m808K778
11047c81557m98M407j714n162m053o961K0710j0022N123Q522k0913J2545n003
11034c84576M005J2091j6656N411M724l763o649j683J6947j3014P583q952J0890
11021c73642l169m227j4616J3517Q576n049n48L69j0078j111J8115r690M606L546
$$ y = [-388868, -380221, -377495, -377917, -378635, -365403, -377754, -380527, -376628, -375266, -385161, -383417, -381336, -367816, -381083, -381806, -380004, -375896, -377430, -394016, -388883, -373513, -379632, -378285, -377951, -390237, -378211, -374079, -371678, -373050, -369401, -382772, -381234, -376200, -369378, -377861, -386455, -393147, -380913, -380867, -374380, -386787, -380894, -365740, -376628, -384931, -378095, -376882, -393777, -393506, -371398, -374327, -373633, -378690, -385789, -379704, -380222, -387062, -386338, -384682, -381138, -377063, -382860, -391860, -376300, -379436, -374066, -378987, -379527, -384335, -381557, -382055, -377648, -379362, -384524, -388577, -395538, -374828, -384850, -379727, -371205, -392118, -379573, -384576, -380571, -368480, -385136, -379725, -375001, -378764, -385413, -387096, -370149, -383163, -375580, -384532, -373642, -376811, -381038, -395654, -382137, -373561, -378610, -379158, -378789, -388867, -389978, -371863, -381553, -376947, -373401]
11007c73401N289j4840N31P324j168p73n99M950j5480M372N671R896k4207R061
10993c83374L676K526O401N74K904r165k127j1582J981J4500j1585O734j1330
10980c89867J9158p700p171J0867r741L887M084K609q243N326P23m842l212R842
10966c74280o625m619M276O304p259O865j4540N556J2072N467j4590J976N060
10953c74337n693k337Q386o417p99M969O285l741r131j132M245O671j383o404
10939c80818p807K000L281L595K706j7200J6991P466j0046L626j0182J3647k0982
10926c93723Q218m871R242M604p52j0003J0112j979J870M95r882J0894m927J0411
10912c70291j7354J578Q062m952P448N680j4088N261N499n37k317r62L762j1528
$$ y = [-373401, -368112, -382952, -382421, -375097, -376265, -377038, -377637, -372687, -388167, -383795, -378124, -368228, -392435, -383374, -379698, -377172, -370771, -370197, -367293, -376458, -378585, -390167, -388186, -373686, -385271, -378537, -389867, -370709, -378409, -385580, -374713, -384454, -380567, -376483, -373874, -382117, -376791, -376068, -380910, -384122, -374280, -380905, -385524, -381248, -374944, -382203, -375338, -389878, -384322, -372250, -366783, -381373, -379397, -374337, -380030, -382367, -373981, -380398, -381197, -376228, -369943, -373684, -382815, -383947, -379702, -373031, -374414, -380818, -388625, -386625, -383344, -379749, -377043, -394243, -377252, -369786, -379832, -376206, -386388, -372741, -393723, -385505, -390376, -381134, -376530, -377282, -387285, -377173, -379152, -377282, -376787, -386669, -375775, -380702, -370291, -387645, -386067, -378005, -382957, -375509, -369829, -383917, -378656, -373157, -373694, -376011, -376973, -373211, -384739]
10898c84739l354J6895q359l1m05M563p63j764P300m606k099q187N860J1849n265
10883c73105r134N403j505m234m873M3J2241l662J960o16j945L897K8J187p947
10868c82262N349P47N572q613R253j8043J0139O370n835J561M252o802K318l672
10854c79666O332j3345R883k049O950q273k332K08P17O366m555J108K463j1364
10840c87557R381O096k147K268r495O070o529m497R242k25K998O82K608j1470
10826c82575M538J5828j9742Q274r527J0002q034j028K955K590R322j0471J0633
10813c67235o553jJ750l574o297l62M898m142J7217j5386O758j53m575j934N959
10798c73630m290k734R228m248M407k878m596M213p254J2405k2178J7575o831
$$ y = [-384739, -388093, -371198, -379557, -379588, -379993, -375430, -376193, -377957, -370657, -375263, -377362, -385549, -379689, -367840, -373105, -382239, -376836, -378341, -382575, -387448, -387405, -375164, -378826, -376866, -377482, -379427, -375530, -375502, -374315, -382262, -376913, -376166, -370594, -379207, -369954, -387997, -377858, -371488, -377323, -375762, -371510, -378312, -375994, -379666, -373334, -386679, -376796, -378845, -371895, -380168, -382500, -382292, -381575, -375209, -379764, -378656, -376193, -387557, -378176, -372080, -374227, -371959, -381454, -375384, -381913, -386410, -377168, -377393, -374395, -373713, -371105, -382575, -378037, -362209, -381951, -373677, -383204, -373202, -381236, -382264, -379309, -376719, -367397, -377868, -367235, -373788, -373789, -372039, -375613, -381910, -382272, -377374, -381516, -364299, -379685, -372927, -373080, -377655, -379589, -373630, -377920, -380654, -371426, -375674, -371267, -374145, -378741, -374528, -381782, -369377, -391555, -373980, -380811]
10785c80811k502k75J0210j6480N161R730k05o957J655J3953r632M048n073M470
10771c72708L698k370n482L273l718J2075j0506j908J3060r524O086p445m01L438
10757c72432j2317J9882j2187K980j0878J3747j038K802k142J981j0507P709n328
10744c77728n203N748N756j1842j001Q568J0790m657j2250J745m049J8631j1781
10731c77273l619R402k438r502Q658N119k375j0308r86Q568K13j3400J626J0742
10717c75573j1064J9631j1722k241R031j0664N516O71l345R883m600o353J4867
10704c65963j1061J020J5233j3670j738N68r817J3280j4082J573J0549O007j008
10691c69109M288p328J4k830m561L067j628J0961k452M367r542r846N018J702
$$ y = [-380811, -383313, -383588, -373378, -389858, -384697, -374967, -375172, -382129, -380474, -366521, -376153, -372105, -377178, -372708, -369010, -371380, -376862, -373589, -377307, -365232, -375738, -377646, -364586, -374110, -368024, -375469, -375870, -372432, -384749, -364867, -377054, -374074, -384952, -371205, -372243, -369441, -371583, -369602, -380109, -372400, -377728, -382931, -377183, -371427, -383269, -384270, -375702, -364912, -369569, -381819, -380074, -384123, -365492, -377273, -380892, -371490, -373928, -383430, -374772, -369653, -372028, -382336, -383322, -374754, -374541, -387941, -386315, -375573, -386637, -367006, -378728, -380969, -371938, -382602, -377086, -376415, -379760, -369877, -374477, -380830, -365963, -377024, -376004, -360771, -374441, -376179, -375611, -385428, -372148, -386230, -384657, -374108, -368101, -369109, -364821, -372149, -372135, -374965, -379526, -376459, -378087, -367126, -369578, -365211, -374753, -384599, -379581, -377879]
10677c77879j54o705J2196r335L540J1640j2287J0580J082k059j7860J7775j4077
10664c83543K046L868l27j486K953l195M249q790J2932q021J4647q606J0603r122
10650c71792l367r74Q643k627p390o118J1104k003N434L71n364M389J2785j3159
10636c70068j495M801j689j0496J4661j152q295P05L436n461J696m816L969J0594
10622c63610j4712J3671j4708R48R52j48R508n167N76n574J0492j0211Q57l836
10608c80962J0818k209l731M763L564j2139J5803j3816J1756j1251J1033q068
10596c74439Q681j6003J2089O76j4156K726j0278J7694R834r085k821J1219p791
10583c71654L12L330N957j3725l206O681j5654J6205k476k172J6379p174k962
$$ y = [-377879, -378033, -384738, -372542, -381877, -378337, -366697, -378984, -368404, -367322, -369381, -387241, -369466, -383543, -381497, -377629, -377956, -379442, -376489, -379684, -375435, -384225, -371293, -379314, -364667, -373273, -362670, -371792, -375159, -376133, -367490, -370117, -377507, -383625, -372521, -374524, -369090, -368719, -374083, -369694, -356909, -370068, -371563, -366762, -368451, -378947, -364286, -365438, -373733, -373028, -369592, -375053, -373357, -378173, -374204, -363610, -378322, -364651, -379359, -378411, -377459, -377607, -368099, -373266, -372690, -378264, -367772, -377983, -377126, -380962, -370144, -372353, -376084, -371321, -367757, -379896, -364093, -377909, -366153, -377404, -366371, -374439, -365758, -381761, -369672, -368996, -383152, -380426, -390704, -373010, -363176, -372261, -375082, -363863, -371654, -371342, -368012, -362055, -375780, -378986, -372305, -387959, -371754, -374230, -376402, -360023, -367197, -370159]
10570c70159O425j2480K665o645J3610j5331J2221n418n562J5210m400P24k961
10557c72101r230J1909l074j0278P796P722p326o290k245J0617j1550J0417o240
10544c79873N901J1138j5827P003M199j0308K159l398q34M171m479J978n771Q983
10530c74958R445j2745Q591j4256K4405o219q620M566R592p833P22P286m962j8187
10516c83173O85k010O934J479P961K25p722o431J1301p9L5n780r648K1519r519
10501c74223N556J772M4j832k126P04N156q569M565l148M37k936p81P088p415
10486c75708Q559j2364Q056N271k095n673j48M010O884j898n379M01O204R393
10472c54487o200L170j0149M180o715k018Q204j0031r471J3745O21j5836J4196
$$ y = [-370159, -363734, -376214, -373549, -380194, -366584, -381915, -369694, -375112, -380674, -365464, -369864, -369140, -372101, -381331, -369422, -372496, -382774, -374978, -367256, -374582, -380872, -383117, -372500, -384050, -373633, -379873, -373972, -362834, -378661, -371658, -367459, -377767, -375608, -379006, -379840, -375669, -380148, -378170, -383941, -374958, -365513, -378258, -369667, -383923, -359518, -365737, -374357, -369791, -360199, -368032, -367310, -360024, -364986, -383173, -382488, -384498, -377564, -376085, -368124, -367899, -375621, -382052, -370751, -370830, -370795, -376575, -386223, -364704, -374223, -368667, -366895, -366851, -368683, -370809, -370105, -364949, -373518, -368953, -372101, -371664, -374600, -375381, -368293, -375708, -367149, -379513, -371457, -366186, -368281, -373954, -374102, -370092, -363208, -365106, -370485, -370084, -363880, -354487, -360687, -357517, -367666, -363486, -370201, -372219, -364015, -374046, -383517, -369772, -369151, -384987, -370791]
10459c70791J78k739N066m568j1381J5507N285o169Q627j7444J0127Q959n594
10446c64937j0671L950L599p730Q054j538j7045R851J4134j2989L261j812k450
10433c76323R603p11j0947o022J1635j883p622M751J060p034J0413k589Q939o990
10419c73720K822o811N014j15N194P491p858j1028R901o565J4774l774o406K260
10405c68821N352q460J1127j6990j2583R570P842k894J1749j2830J0813m504m414
10392c75043J379Q113M004j7055J856R851n800M902r345N856R74J392k568m153
10378c75637M416L031r389J3151j5416J1958j804j781K02M348j0274M647R454
10365c63094o527m738k204n348O083j0022J1610P322j0246O929o06j0597J4436
$$ y = [-370791, -370613, -373352, -368286, -372854, -384235, -368728, -363443, -369612, -360985, -378429, -368302, -359343, -364937, -375608, -371658, -368059, -375789, -367735, -369273, -386318, -376467, -362333, -375322, -372061, -373873, -376323, -366720, -367431, -378378, -384400, -372765, -374648, -382270, -377519, -376459, -383493, -373080, -375669, -366730, -373720, -370898, -377709, -372695, -372810, -367616, -360125, -367983, -379011, -369110, -375675, -360901, -364675, -371081, -368821, -363469, -371929, -360802, -377792, -390375, -380805, -372963, -375857, -364108, -376938, -366125, -370629, -375043, -373664, -365551, -361547, -378602, -376746, -366895, -372695, -367793, -377138, -371282, -370308, -368916, -371484, -375637, -371221, -368190, -377579, -364428, -379844, -367886, -369690, -371471, -371269, -366921, -377195, -372548, -363094, -369621, -374359, -376563, -381911, -375828, -385850, -374240, -366918, -377164, -370235, -370841, -381438, -367002]
10352c67002l389Q96m376N067J2405k58o779M546n39j1786j762kM246k895p014
10337c78642q51j4149K7014n394n803R061j0359N997p078Q579m149q193N983O816
10323c71168p061J514m513Q840p072R867p108O116N288m955p9j0117J0514k034
10309c71968n885j594J3661p060p07p74J454m392L669n246k448J7473k5617K2410
10295c67024r932n492J1132k1831J6941Q709P9P294j4768L602p328p409J9239
10282c66788j0221j364J1737j3155J3518m656j6571P142M22m635R509j2696L273
10269c84485n184Q132k630m86K048o39P115q697m831J2373p571J0394j685o275
10255c82421K2363k6906R311J669l284O449r118o910O392K443K400n769j0395
$$ y = [-367002, -370391, -369495, -373871, -368804, -356399, -356657, -363436, -358890, -359429, -371215, -372977, -372979, -368733, -371628, -378642, -379493, -393642, -366628, -372022, -377825, -368764, -379123, -373126, -380204, -371625, -375774, -383967, -377984, -371168, -378229, -376715, -381228, -372388, -379460, -369593, -376701, -370585, -365297, -370252, -370331, -380448, -369934, -371968, -377853, -379447, -365786, -372846, -373553, -374327, -372873, -377265, -373596, -378842, -381290, -363817, -389434, -367024, -376956, -382448, -371316, -393147, -376206, -367497, -367418, -360124, -374892, -371290, -378618, -386027, -366788, -377009, -378373, -366636, -379791, -366273, -370929, -387500, -380358, -379936, -384571, -375062, -387758, -384485, -389669, -381537, -384167, -384653, -382605, -383244, -376129, -384826, -389657, -377284, -384855, -374461, -376146, -382421, -360058, -386964, -377653, -375984, -379268, -372819, -381937, -388847, -382455, -380012, -377612, -383381, -393776]
10242c93776P996J939K719n551m746K3615j1261l400M107J1454j9565O605p788
10229c87652J1782o215m192N419O412P365j1044k182J1189j3145K009q861J0356
10216c78759m053M999o776P485p716L99O875l871l190J337N048j0259J3528p676
10202c82629M853o409N178O964j2504q476J1495K35N604K235j178j877j0614J575
10188c85548N673m231l618J9853j2770L433P714m810n755R917k4969J7152q345
10175c86304O208l195M300m331N482l427m71J043n312Q920n29P935j0133q728
10161c88542R520m770Q642J048n713l290p239R164J241j0279N96J4570j2104N080
10147c82076O07N561q212L74L192o546j482O272K179o489P782P087j0383k643
$$ y = [-393776, -385780, -383841, -381122, -386673, -391419, -367804, -379065, -382465, -378358, -366904, -386469, -379864, -387652, -375870, -382085, -386277, -380858, -374446, -367081, -378125, -380307, -369118, -382263, -380254, -389115, -378759, -382812, -377813, -384589, -377104, -384820, -384421, -377546, -381417, -384607, -383270, -378222, -388481, -374953, -382629, -377776, -384185, -379007, -372043, -384547, -393023, -381528, -381293, -375689, -373454, -374632, -376509, -387123, -385548, -379875, -384106, -387724, -367871, -380641, -377208, -369494, -374304, -380059, -370142, -395111, -377959, -386304, -380096, -383291, -378991, -383322, -377840, -381267, -381738, -380695, -386007, -377087, -377616, -369681, -379814, -388542, -379022, -383792, -375150, -374102, -379815, -383105, -390344, -381180, -379939, -390218, -389622, -375052, -387156, -382076, -381469, -375908, -384120, -383746, -380554, -387100, -388582, -382310, -380131, -386620, -378838, -371751, -382134, -384777]
10133c84777O903J809K939j2770R798p179k651J899J0150o677K122J524j1188
10120c88098P265L080j4363J5669k064L74m109J0907r562K744N010q09m892P798
10106c71050m213l319N98J837N038j681M143n099r036J1994j1900J3865j315j8449
10092c88587Q854k181R558k143P35K56n753l094M121l941J1214q097m297R644
10078c73711J149j5952J0118m44m075M463P61q931J3219j2430L068J3587j8468
10065c87646p076J4201k125N525J6842k8135J7497l034n895L8M34J154j275q368
10051c87863O631J5315o215l182j0314J0720J015n371J1437j3614m412J2141p215
10038c80927K449N858j0082P133J2911j0940l514K876O079o732R858p101L660
$$ y = [-384777, -377874, -376065, -373126, -385896, -376098, -383277, -385928, -384029, -373879, -380556, -378434, -376910, -388098, -380833, -377753, -392116, -376447, -378511, -378137, -382246, -371339, -380901, -378157, -373147, -373956, -378848, -371050, -375263, -378582, -377984, -376147, -371109, -372790, -368647, -373746, -382782, -370788, -382688, -368823, -370138, -388587, -379733, -381914, -372356, -374499, -373764, -373508, -379261, -382355, -378234, -382175, -370961, -379058, -383355, -373711, -372562, -388514, -378396, -378840, -382915, -378452, -377691, -386622, -373403, -385833, -382765, -369178, -387646, -394722, -380521, -382646, -377121, -360279, -388414, -370917, -373951, -379846, -379808, -379374, -378220, -379495, -387863, -381232, -365917, -372132, -375314, -385628, -374908, -373893, -379264, -367827, -381441, -385853, -373712, -380927, -378478, -372620, -382702, -375569, -362658, -373598, -377112, -374236, -368157, -374889, -365031, -372132, -368472]
10025c68472o77l260N908o500J1612j0813K460J859J5517M419j5267r416J65J1277
10011c61188j0875O042J718N700q639J5615l983J0073o821J0665j1020Q972p621
9998c51362m125K1504q580J5078j5754L842J7519K326j768K797K2168J7939J4099
9985b64317K1528J5327J5701N0440M9308M3601O9756K5186m575M0798Q0392P8924
9973B22069K011k5756p9609m9714k8805k6554l3651p1403o9053m2385l7244l6051
9961b76145j6301j5290j4795R821k3106N984l872j3583Q173k500k116L793P949
9948c31988p126j5265j664j708j935K134l949q004O856J0981m075l969r668J289
9934c68091J2127j4634N834j1481J9267q049m657J0791j0304m824L383J2721j4661
$$ y = [-368472, -369149, -372409, -366501, -373001, -361389, -372202, -369742, -367883, -352366, -347947, -363214, -372630, -372465, -361188, -372063, -366021, -364303, -358603, -367242, -351627, -355610, -345537, -352358, -341693, -352713, -343741, -351362, -355487, -333983, -342563, -327485, -343239, -339397, -321878, -319552, -321320, -318523, -296355, -278416, -264317, -242789, -227462, -211761, -161321, -112013, -68412, 1344, 26530, 21955, 62753, 143145, 222069, 224080, 198324, 118715, 69001, 40196, 13642, -20009, -91412, -160465, -202850, -240094, -276145, -292446, -307736, -322531, -312710, -335816, -329832, -333704, -347287, -339114, -341614, -343730, -339937, -331988, -339114, -354379, -356043, -357751, -359686, -357552, -361501, -369505, -362649, -351668, -355743, -359712, -369380, -368091, -355964, -370598, -364764, -376245, -356978, -365027, -369684, -358893, -369197, -374021, -370638, -357917, -372578]
9921c72578J0864L122j340K622o872l628O785O393l15m55n636K575k467q130o32
9906c69692J2589o288O576r895L980j3747J1203L189j0414J1102k254lq980q814
9892c81448J0629m997Q18P550L183k454O189j7052P682m01J6365l781q529m805
9878c71051Q982J8457o361J0666k6839Q663l275M171M626Q97p801J0648M206m351
9864c48362j33J6954R699N509o387n330K914P159o232J3171N336n100K0545m284
9850b94541l605O877j8443R928j8800k944L85J374M868m751j1810R842J8050O843
9836b96727o384J1388j0420J4336K6721N3055L9860N0957J2396j6707m9515n1652
9824b22692l4966q518j8258k3461k963j9938L260j7052j3133J1607k431Q359o105
$$ y = [-372578, -361714, -358592, -359932, -357310, -364182, -367810, -361025, -354632, -354947, -355402, -361038, -358463, -360930, -369060, -369692, -357103, -363391, -356815, -366710, -362730, -376477, -365274, -362085, -372499, -361397, -363651, -363654, -372634, -381448, -370819, -375816, -374998, -367448, -364265, -366719, -360530, -377582, -369900, -370301, -353936, -357717, -366246, -371051, -362069, -343612, -349973, -339307, -366146, -357483, -360758, -356587, -351961, -351064, -358865, -348217, -344011, -348362, -348495, -331541, -321842, -316333, -322720, -328050, -325136, -317977, -324209, -311038, -305702, -310802, -290257, -294541, -298146, -291269, -309712, -299784, -318584, -321528, -321143, -319769, -314901, -319652, -331462, -321620, -303570, -296727, -303111, -291723, -302143, -287807, -261086, -208031, -168171, -117214, -104818, -121525, -171040, -222692, -257658, -266176, -284434, -307895, -310858, -330796, -327536, -344588, -357721, -346114, -348545, -340186, -346291]
9811c46291j5594j5J6477j3125k180K245m753J620o14k990R060j1970J5555j7890
9797c70465O537l091j0517Q119r620o388M398J0992p29q68j9697J4544O042R941
9783c60802r359N368j6369R649l430k135k113j136l952J8736q950k575k401O982
9769c72487L747j7698Q185j394J908M605j3624O877j331j67N889J2339o547q253
9755c77951l683p341O974r43R561l906o172Q100p215P801o283j419J117k360J4767
9740c68953M65p232n586J335J4529k523k688R272j6848J976K217M428m92l875
9726c73975M932j1555P615J2107j0081j832K010J1687k6337K9101j4797l543M626
9713c70042J1566q885P046l958N115J517Q721r938j1235Q796J104J0413q999J588
$$ y = [-346291, -361885, -361900, -345423, -358548, -360728, -358483, -363236, -361616, -362230, -365220, -356160, -368130, -352575, -370465, -363928, -367019, -377536, -369417, -379037, -385425, -381027, -370035, -370764, -371632, -391329, -376785, -370743, -360802, -370161, -364793, -381162, -371513, -374943, -377078, -379191, -380327, -384279, -365543, -374493, -377068, -379469, -372487, -368740, -386438, -378253, -379647, -377739, -373134, -386758, -379881, -381212, -381379, -375490, -363151, -369698, -377951, -381634, -388975, -382001, -382944, -373383, -377289, -383461, -375361, -382576, -374775, -381058, -382477, -381360, -383720, -368953, -368488, -375720, -381306, -379971, -365442, -367965, -370653, -361381, -378229, -376253, -374036, -369608, -370100, -373975, -369043, -380598, -372983, -360876, -370957, -372789, -370779, -359092, -385429, -356328, -371125, -374668, -370042, -358476, -367361, -360315, -364273, -359158, -357641, -348920, -358858, -370093, -361297, -360193, -349780, -358779, -357191]
9699c57191R394j8826K2244j1069K754J903j59k158M931k306L92j03K640q149
9685c55703J3024j165j844L754R154p561L526N492r714K80o814j080j373J1868
9671c38156L855j4483J0190n279n278Q010M128L926k339J748r361J4799o741J1649
9657c23332J122r35P915J3418J9399L8634M4466L930k2879l1208k1228l3752j493
9644c05943j4879J3186j4210k2124K0737q566P328j2607M581n267K965p235l936
9631c45970J5540j1470J3935j6192J3549R596R748j4233j985J293N072L093O345
9618c11679k111n810N426k888n140K2162k4052p435K0285P99J557m331m057J826
9604c15448l81R539J028J1730j3374N108J0458o29l7j459O845J5117j9099K173
$$ y = [-357191, -347797, -366623, -344379, -355448, -352694, -350791, -350950, -353108, -348177, -350483, -350091, -350194, -347554, -355703, -342679, -343844, -345688, -341934, -332780, -340341, -336815, -331323, -341037, -340757, -347571, -348651, -350024, -338156, -334301, -348784, -338594, -343873, -349151, -341141, -337013, -333087, -335426, -333678, -343039, -328240, -334981, -323332, -322210, -323145, -315230, -301812, -282413, -243779, -199313, -195383, -218262, -249470, -270698, -304450, -305943, -320822, -307636, -321846, -343970, -323233, -331799, -324471, -337078, -332497, -337764, -334799, -342034, -345970, -330430, -341900, -327965, -344157, -330608, -321012, -311264, -325497, -327482, -326189, -321117, -318024, -311679, -313790, -319600, -314174, -317062, -322202, -300040, -324092, -331527, -311242, -310443, -308886, -313217, -317274, -315448, -315829, -306290, -305262, -293532, -306906, -301798, -291340, -291969, -292006, -293465, -286620, -271503, -290602, -288429]
9590b88429J3806K41q263o867J5884j771J2642m514J1161L049K2064M788L292
9577b22917k969P989K9767L4521L175O40p379O302k47K5571j5320j2125j9997
9564a72989k5754J2673r679q058j7901l933n173J511M550m960m657J0943K3896
9551a99531L915J4212P901N311n723J2970J4463J2114L2978L8578J8036j8211
9539f2987j2187l3696K1043N172J4911J397j7023k2582p829j6746k859o174n681
9526a45241pL2758j5129K3362K7408N6857P1007O3126K1719l9618m9835l4020
9514A2387J919M4856M6653L5248N2395J0127j0058l9762m3556m3383p718Q579
9502F7687J7516N1703L2158K6902K2469O707M0754P1156o102o1590p5744m1453
$$ y = [-288429, -274623, -274382, -282645, -289512, -273628, -275399, -262757, -267271, -256110, -253061, -230997, -226209, -222917, -225886, -217897, -188130, -153609, -150434, -149794, -157173, -150871, -151118, -125547, -140867, -152992, -172989, -198743, -186070, -195749, -203807, -221708, -225641, -230814, -229303, -224753, -229713, -234370, -223427, -199531, -195616, -181404, -173503, -168192, -173915, -160945, -146482, -134368, -101390, -62812, -44776, -62987, -75174, -108870, -87827, -82655, -67744, -66347, -83370, -105952, -113781, -130527, -133386, -139560, -145241, -145248, -112490, -127619, -104257, -76849, -19992, 51015, 114141, 135860, 96242, 46407, 12387, 14306, 59162, 105815, 141063, 193458, 203585, 193527, 153765, 110209, 66826, 59108, 67687, 85203, 136906, 169064, 195966, 218435, 225142, 265896, 337052, 330950, 269360, 193616, 152163]
9490A52163R14o974j6057J4457L212L9333J0790j3987M4806P0092N7904l198k9462
9477C23993k9461l0906k3246m1554l686l1628p044j3971j1555J291k354N11j7618
9464A12772j3134P339j4574Q757k5196J6417J8533K5718N0078L1120N8205L4911
9452C10946M7709O0005O6701N8877M5404K9067P1165P3541N9987l89n6730p1345
9440F94938o2547l7253j9679k6581l9409j8546j0279K594j8625J4395J0608k1447
9428D68169R906j4187o247P660R933J5264L3065N7316L8206L4420K5513K3469
9416G02487K3667M4396M2180K0703J277j4750l8823n6762o6856q3769o9088m9323
9404D55339n0806m9945l5837m609l0055L747k1956q403J0302L3953J6557K2760
$$ y = [152163, 153077, 146103, 130046, 144503, 147715, 187048, 197838, 183851, 228657, 298749, 356653, 353455, 323993, 294532, 263626, 240380, 198826, 195140, 163512, 156468, 142497, 130942, 132233, 129879, 130390, 112772, 99638, 106977, 92403, 101160, 75964, 92381, 110914, 136632, 186710, 217830, 276035, 310946, 358655, 418660, 485361, 544238, 589642, 618709, 689874, 763415, 823402, 823013, 766283, 694938, 632391, 595138, 575459, 548878, 509469, 490923, 480644, 483238, 464613, 479008, 489616, 468169, 478075, 463888, 457641, 465301, 475234, 490498, 523563, 580879, 619085, 653505, 679018, 702487, 726154, 770550, 812730, 833433, 834710, 819960, 781137, 724375, 657519, 573750, 504662, 455339, 404533, 354588, 318751, 314142, 284087, 287834, 265878, 257475, 267777, 301730, 318287, 341047]
9392C41047K2127K2722P861p802j5678k5018l6714k1223P937N74k304Q260K0928
9379C22717K1085K4646J9288J944J6205P592N287j347j8211j6649L451Q594J4066
9366D08668o628O012k2602K0866p37k3J6642K3982J0816K214J7303j3551p005
9353D55957k2497P1J9877K3819M1394K4972R004r926k3136j0466N37O617J9821
9340E36044J5393R752R544J1607O287o135M966l95l392j352l905L1936p913P595
9326F10032j1968l433p352j0838q782r785J4112K4506L3899N6484L8503L9071
9314G64449P47P676J4325K3197M3572J8969P366R408K5784L0417K5335L9064M2826
9301A053135N8263M5878n608n5117l4486J7984L5463J02771Q3368M3721N4777
$$ y = [341047, 363174, 385896, 393757, 385955, 370277, 345259, 308545, 287322, 295259, 295833, 293529, 301789, 322717, 343802, 368448, 387736, 389680, 405885, 413477, 418764, 417417, 399206, 382557, 386008, 394602, 408668, 402040, 408052, 385450, 406316, 405579, 405556, 422198, 446180, 456996, 459210, 476513, 462962, 455957, 433460, 433531, 453408, 477227, 518621, 543593, 552597, 542671, 519535, 509069, 509606, 516223, 536044, 551437, 561189, 570733, 582340, 588627, 582492, 587458, 587063, 583671, 582319, 578414, 610350, 602437, 610032, 598064, 594631, 587279, 576441, 567659, 557874, 571986, 596492, 630391, 686875, 725378, 764449, 765196, 772872, 787197, 810394, 853966, 872935, 880301, 889709, 915493, 945910, 971245, 1010309, 1053135, 1111398, 1157276, 1151668, 1096551, 1062065, 1080049, 1115512, 1218283, 1301651, 1345372, 1400149]
9290A400149M6769R794n0477m8888J2099J148K9691K2707N2792M0387N3063N4238
9278A623472M6385R2232R3441M2917m86L2855N0239L1597J321m9020m1077k0363
9266A903513L4347J1476L929L9195P5119O6355k7674l2241l141J8979J8409J4731
9254B122997L595K0867J7711M3964L0691O1778L7259K3371K9045M0337K8871K7977
9242B488463L7163L7774P0059P1384R4280Q2843O0907O2479L5126L4182J3842
9231C088502R454N6906P5728J13570J43589J34073J10426Q9004N0310R2969J15004
9220D079535J40778J78091J75721J58564J15627P4833O4227J24061K70802M38040
9210E820279M27826J26054q0036p4277l5167M3034R9354J46543J94069K56602
$$ y = [1400149, 1446918, 1456712, 1406235, 1357347, 1369446, 1370594, 1400285, 1422992, 1475784, 1516171, 1569234, 1623472, 1669857, 1762089, 1855530, 1898447, 1897961, 1930816, 1981055, 2012652, 2013973, 1964953, 1923876, 1903513, 1937860, 1949336, 1953265, 1992460, 2067579, 2133934, 2106260, 2074019, 2070878, 2089857, 2108266, 2122997, 2126592, 2147459, 2165170, 2209134, 2239825, 2301603, 2338862, 2362233, 2391278, 2431615, 2460486, 2488463, 2525626, 2563400, 2633459, 2704843, 2799123, 2881966, 2942873, 3005352, 3040478, 3074660, 3088502, 3097956, 3154862, 3230590, 3344160, 3487749, 3621822, 3732248, 3821252, 3871562, 3964531, 4079535, 4220313, 4398404, 4574125, 4732689, 4848316, 4923149, 4987376, 5111437, 5382239, 5820279, 6248105, 6374159, 6294123, 6219846, 6184679, 6227713, 6327067, 6473610, 6667679, 6924281]
9200F924281K33139J02162K381J7030J17775K05674K73140L23342L58688L50942
9190H908554L31529L22966L52893M43652N35331N52159L88911J62513N2063J14891
9180A2165462K42222L79442M35068M91534P22227R15270P33206K3310J1935N25889
9170A6645565Q68204O87018N76503J1201l18616j09107J33408N67651Q73507O77240
9160B0612574M73165N30411M96856M81213O56743P86761P12824P47806R59095
9151B6457448J339910J800184K548933L642762M525339L853254K906332M058527
9143E1132689P199188J0184079Q504308O916187R996795J0086714O351188L772095
9135A14143243L915010M861335N866692P151116K340472n975212n575581j266252
$$ y = [6924281, 7157420, 7259582, 7261963, 7278993, 7396768, 7602442, 7875582, 8198924, 8557612, 8908554, 9240083, 9563049, 9915942, 10359594, 10894925, 11447084, 11835995, 11998508, 12050571, 12165462, 12407684, 12787126, 13222194, 13713728, 14435955, 15351225, 16084431, 16107741, 16119676, 16645565, 17513769, 18200787, 18777290, 18788491, 18469875, 18360768, 18494176, 19061827, 19935334, 20612574, 21085739, 21616150, 22113006, 22594219, 23250962, 24037723, 24750547, 25498353, 26457448, 27797358, 29597542, 32146475, 35789237, 40314576, 44167830, 47074162, 51132689, 58331877, 68515956, 77020264, 83936451, 93933246, 104019960, 110371148, 114143243, 118058253, 122919588, 128786280, 135937396, 138277868, 132302656, 126727075, 125460823]
9127A25460823J881956L650203M687903Q049611J7406335L8100627P8357647J19303496
9119C96898601Q5828718j0115453p2889599q6019738p3268476n5618726l8581696
9112A46233631k5071266j5613094q778708m048145j958932k606402l504299l284131
9104H1368654k152823L32350L635569M823412P77378n153136p208107o917988
9096F9505309n767588l893576j980874L48146K354545N79822l011337k977917
9088E5156530p54138k56488k181375j566084p82653q99899j634953k894846l670190
9079D0515904k925211j750297j155592j208172j217015q07721n60497q47210r53073
9070B9091116k38138J182301K659384K445056j12266k172336k565743k129187
$$ y = [125460823, 127342779, 130992982, 135680885, 143730496, 161136831, 199237458, 277595105, 396898601, 482727319, 472611866, 399722267, 313702529, 240434053, 184815327, 146233631, 121162365, 105549271, 96770563, 92722418, 90763486, 88157084, 84652785, 81368654, 79215831, 79548181, 83183750, 88007162, 88784540, 83631404, 76423297, 69505309, 63737721, 59844145, 57863271, 58211417, 60565962, 61145784, 58134447, 55156530, 54402392, 54145904, 51964529, 50398445, 49615792, 48715893, 47080940, 44186094, 40515904, 37590693, 35840396, 34684804, 33476632, 32259617, 31451896, 30891399, 30044189, 29091116, 28852978, 30035279, 32694663, 35139719, 35027453, 32855117, 30289374, 28160187]
9062B8160187j066309j92118j066993k302070k196657j739113j339512q16176
9054A7441239l15712p2021j52422k01557j08495m4200p0670J68064N32787J54699
9044A7331712j141287j739213j533034j159673q22236n78935l87969j87075J08391
9035I890681L92479L30329k87261p78634q02458o57792n36250m18848l47877k70518
9025F513851k31560k10872k03198j76901j99333k05564k53189k26753k05586j73176
9015D427719j51166r5313j06994j01641q7985q1860n3934o9530q7498j07145r9854
9004C384799j18098j07472r8153p5011o4958l9571k9235m1720l5797m8570n0459
8993B675755p8511n9143q9617o7929r1272n7925m6612l6893l5009k9720l9426
$$ y = [28160187, 27093878, 26901760, 25834767, 23532697, 21336040, 19596927, 18257415, 17441239, 17125527, 17053506, 16901084, 16699527, 16591032, 16546832, 16476162, 16644226, 17177013, 17331712, 16190425, 14451212, 12918178, 11758505, 10936269, 10357334, 9969365, 9782290, 9890681, 10283160, 10613489, 10326228, 9547594, 8745136, 8087344, 7551094, 7132246, 6784369, 6513851, 6282291, 6071419, 5868221, 5691320, 5491987, 5286423, 5033234, 4806481, 4600895, 4427719, 4276553, 4181240, 4074246, 3972605, 3884620, 3802760, 3748826, 3679296, 3591798, 3484653, 3384799, 3266701, 3159229, 3061076, 2986065, 2921107, 2881536, 2852301, 2810581, 2774784, 2726214, 2675755, 2597244, 2538101, 2448484, 2380555, 2289283, 2231358, 2184746, 2147853, 2112844, 2083124, 2043698]
8982B043698n9407l5663l5570J6869m3106m6345m0820m5042m4703k5192m7770
8971A636949l8752o2550q9094q2948n5282m3751k5366j7774p734l1085l5213k9968
8959A117432M816j9110j7666j8242j7688m1755j4079l4825k7993m9228l6260l5009
8947H10393m5900l6840k5071N232O650L6030J5606o790k0960j5916l6549k3527
8935F62358j2230j4900M989j5766P47k4726o625j6464k9806p040j2266j8611j2599
8922D97061k4107K9998M220L222r889j3588j0693l3612l1567p09k0116j2777j7528
8909C59915j0250q340k0427j5252N002j8144n584r564J8152k6421R643j4575j1185
8896B52970j3862n281k4321M777l0357j0499J8229j7786j5677m704p771q056j1585
$$ y = [2043698, 1984291, 1948628, 1913058, 1929927, 1886821, 1840476, 1799656, 1754614, 1709911, 1684719, 1636949, 1598197, 1535647, 1446553, 1363605, 1308323, 1264572, 1239206, 1221432, 1213698, 1182613, 1147400, 1117432, 1122248, 1103138, 1085472, 1067230, 1049542, 1007787, 993708, 958883, 930890, 881662, 845402, 810393, 764493, 727653, 702582, 707814, 714464, 750494, 766100, 759310, 738350, 722434, 685885, 662358, 650128, 635228, 640217, 624451, 625198, 600472, 593847, 577383, 547577, 540537, 528271, 509660, 497061, 472954, 502952, 507172, 510394, 500505, 486917, 476224, 442612, 411045, 410336, 390220, 377443, 359915, 349665, 341325, 320898, 305646, 310648, 292504, 286920, 277356, 295508, 269087, 278730, 264155, 252970, 239108, 233827, 209506, 214283, 183926, 173427, 191656, 173870, 158193, 153489, 145718, 137662, 126077]
8883A26077q016j0752j3803n18r606O166N310j5196o497j0229q032k844j2925
8870C9135m448J3262N182J737P282j905l054J006k5560m570r902j716l092l928
8856I429r454n30L863R168o12o755K5929J5566K6762L2195L7675K4787K4828K1467
8842B14318L3061J5640j5420l9524m0462l3039K861K1494J8809K8860M5548L4564
8830B86710L2444K0855K5359L799L2946J3189L7796N0297K4975K8725L2506L462
8818E93063r679q903l0977j2930k2129J260P947k4747n2590n9991k4349k1406
8806C34569j7644J5995J3405N960L471O496k07L410j611J2597J2063J4742K0099
8793D23345R636J5759L896k3143k5454r500r997j2337O078l5861m3783j0851M420
$$ y = [126077, 118061, 107309, 93506, 92988, 83382, 89548, 94858, 79662, 73165, 62936, 54904, 52060, 39135, 34687, 47949, 53131, 54868, 62150, 60245, 57191, 58197, 32637, 28067, 18165, 16449, 13357, 9429, -25, -555, 3308, 12476, 11864, 5109, 31038, 46604, 73366, 105561, 143236, 168023, 192851, 214318, 247379, 263019, 247599, 208075, 167613, 134574, 137435, 158929, 177738, 206598, 252146, 286710, 319154, 340009, 365368, 369167, 402113, 415302, 453098, 503395, 528370, 557095, 589601, 593063, 583384, 574481, 543504, 530574, 508445, 509705, 517652, 492905, 440315, 380324, 355975, 334569, 316925, 332920, 346325, 352285, 355756, 362252, 362045, 365455, 363844, 376441, 388504, 403246, 423345, 432981, 448740, 452636, 429493, 404039, 394539, 384542, 372205, 378283, 342422, 298639, 287788, 292208]
8780B92208j3199j4191k3761o5256m6605m1737l3345j1287r599P124N858J6250
8768F2460o845J801k0806k1277k229k7556J898N599r86l853N008J0111j5714Q875
8754c514j6977l1633l0129J6274J847j5039Q899M841L073Q800k4454k2434j4767
8741a15213n234k1464q66q933j3119P446J1591J0928J7767k2160L506k6167k443
8728a64361j6809m516j3808N746N926j028j82N960j7368j7957k93j7101J82M362
8714b31247j9454P855P218j1518O604j6503p3j0555o787J6963N63L950r832J5274
8700b47542k3021J2292m997J3024k4042K325M520j0024o782M801r077P375o27
8687b81775k0229m696J7161j0148n46R268j0116N892j5533J7428L599l289j347
$$ y = [292208, 279009, 264818, 241057, 175801, 129196, 87459, 54114, 42827, 33228, 40352, 46210, 62460, 55615, 57416, 36610, 15333, 13104, -14452, -12554, -6955, -7941, -11794, -6786, 3325, -12389, -3514, -20491, -52124, -82253, -65979, -64132, -79171, -70272, -65431, -62358, -53558, -78012, -100446, -115213, -120447, -141911, -142777, -151710, -164829, -157383, -145792, -134864, -117097, -139257, -135751, -161918, -164361, -181170, -185686, -199494, -193748, -187822, -188850, -189032, -183072, -200440, -218397, -218690, -235791, -235609, -231247, -250701, -242846, -235628, -247146, -240542, -257045, -257118, -267673, -274460, -257497, -256934, -252984, -262816, -247542, -270563, -258271, -263268, -250244, -274286, -271961, -267441, -277465, -284247, -279446, -288523, -281148, -281775, -302004, -306700, -289539, -299687, -300233, -290965, -301081, -295189, -310722, -293294, -289695, -292984, -294331]
8674b94331j9o608M697K388J5194L075j8222j3816r832l681J6640p888n358r620
8660c27381N472r09O43p164q51l191N605o990k72P362l96j966l466K37k186O645
8644c28808J9952k9129P860j2466L487J530K961L842q082J123j1363O484J500
8631c41109n170o408J2740n503P918L598m407q553P148r107R214q121N746P251
8617c34763k726j2675P817j4053M973P118L745p51l178N703M767k481L113m56
8603c33847p443p445J345L843k15j1166N606R18Q199j0448l756J0715j3388Q914
8589c48168O02k741r610J0985q564J4946k052m012j428k977o964Q433k874M295
8575c50129j7428J7468j6615J9284j3112M4P094j1177J0052l727j3289J9716j048
$$ y = [-294331, -294350, -300958, -296261, -293873, -278679, -275604, -293826, -307642, -317474, -321155, -304515, -312403, -317761, -327381, -321909, -322818, -322175, -329339, -330190, -333381, -327776, -334766, -335038, -327676, -328072, -330038, -333504, -333267, -335453, -328808, -308856, -337985, -330125, -342591, -339104, -337574, -334613, -330771, -338853, -337730, -349093, -342609, -341109, -346279, -352687, -339947, -345450, -337532, -333934, -338341, -346894, -339746, -348853, -339639, -347760, -342014, -334763, -337489, -350164, -342347, -356400, -351427, -344309, -340564, -341315, -344493, -338790, -334023, -336504, -333391, -333847, -341290, -348735, -347390, -343547, -343762, -354928, -349322, -348404, -340205, -350653, -354409, -343694, -357082, -348168, -347566, -350307, -359917, -348932, -357496, -342550, -344602, -348614, -350042, -353019, -359983, -351550, -354424, -350129, -367557, -350089, -366704, -347420, -360532, -360488, -353394, -364571, -354519, -358246, -371535, -351819, -352867]
8562c52867n663k280j27k659j5194J8023p443O023M59r868l411J635J1279o915
8548c69008P083K572K421n926J3039o37r046N021j912P926j4931M180R872j8585
8534c67931j2080M7192o3603L5985j5431K7090j1120J350p798N514n052M844j178
8521c62218k847J176l48l135M671K000m862K375l467O143l855r277J1940j1716
8507c73420K497k297n676Q358m829O543m124J529L624L109j697O33P386n521L459
8492c60426j436m065j481j0477J237J0978q209Q669L473k683p944j222Q68N29
8478c72189L522K2492j8522j0107J2312l22P954Q01k016j0382j2709O763R549
8465c62854p592j212Q844j7148J3492o106p494M548J1503l1781J6847k141O096
$$ y = [-352867, -358530, -360810, -360937, -363596, -378790, -360767, -368210, -362187, -361728, -371596, -375007, -373372, -362093, -369008, -361925, -359353, -356932, -362858, -349819, -350456, -359502, -354481, -356393, -348467, -363398, -359218, -349346, -367931, -380011, -332819, -396422, -360437, -375868, -348778, -359898, -358548, -366346, -360832, -365884, -361040, -362218, -365065, -363889, -364237, -367372, -362701, -360701, -365563, -363188, -366655, -360512, -364367, -373644, -361704, -373420, -370923, -373220, -378896, -370538, -375367, -368824, -372948, -371419, -367795, -364686, -366383, -365750, -358364, -363885, -360426, -361862, -365927, -367408, -377885, -376648, -365670, -373879, -365210, -361737, -364420, -372364, -373586, -372718, -372189, -368667, -346175, -364697, -374804, -362492, -362814, -354860, -354059, -356075, -366457, -379166, -372403, -362854, -370446, -371658, -362814, -379962, -366470, -372576, -380070, -375522, -364019, -395800, -378953, -381094, -374998]
8452c74998j2643j438J0463J2350r007j4363M945o389J0430N21J9174j3992K928
8439c72019o111k508q572R426M752p644J1365j5402J4953L237L144j5445R461
8426c71363k684p943m622K709J6820n089Q779P759k0357Q312o472q716P102P873
8412c67892L464l103j4688M576L862n163R696r400P25P484N980m608K003K330
8398c64734L492k2886L47P129J2858j0062l02k262j1865k446l876J2813N377p181
8384c83598j5825O583M815n355J3n498J1569j0772J2850l966n138j4075R232N362
8370c93803K7893l085O030o402j2843N04J147j5555j891J6819m080O947O211r703
8356c81811J962j372J0115j6514K788j222J2748J629k705j1300L825R85q296L534
$$ y = [-374998, -387641, -389079, -378616, -366266, -375273, -389636, -384691, -391080, -380650, -380129, -360955, -374947, -372019, -378130, -380638, -389210, -379784, -375032, -382676, -371311, -386713, -371760, -368523, -365379, -380824, -371363, -374047, -381990, -386612, -383903, -367083, -372172, -363393, -355634, -375991, -367679, -374151, -382867, -375765, -367892, -364428, -367531, -382219, -377643, -373781, -378944, -369248, -378648, -377923, -370439, -364459, -369067, -367064, -364734, -361242, -384128, -383781, -376652, -363794, -373856, -374158, -376420, -388285, -390731, -394607, -381794, -376417, -383598, -399423, -392840, -388025, -393380, -393367, -398865, -387296, -398068, -385218, -389184, -394322, -408397, -399165, -393803, -365910, -368995, -362965, -369367, -382210, -381706, -380559, -396114, -398005, -381186, -385266, -378319, -372108, -381811, -379849, -381221, -371106, -387620, -384832, -386054, -373306, -371677, -374382, -385682, -381857, -380872, -389168, -385634]
8342c85634j8054K3044o081j824N405m240m849n217J0179N515J656J421j1228
8329c89907K0011j0322n88J032N826p940P092r060N820q561J46R407p981k377
8315c87402R83J0020p535m951l24M080m168q197J4517j9386P171j509K262l466
8301c97905J1390m761r122q35j0396K3613J8298K156k361m917N308j3142j0383
8288c93057P518p753J2423N653L823J050j3391J0816r49n236O079q083O036o285
8274c81356K74P321J6676p352P833M513J1701M430j3663j7811n869j535R347q654
8260c74145J613p344Q283k0058J3640m019j7269J3399L455m311q928Q691j07j2588
8246c99688J2640j6222P091J2221J569N664Q533k710o099R607j0224q587P296
$$ y = [-385634, -403688, -380644, -386725, -388549, -383144, -387384, -392233, -397450, -387271, -381756, -380100, -378679, -389907, -369896, -380218, -380806, -379774, -373948, -381888, -374796, -383856, -378036, -386597, -386451, -377044, -385025, -387402, -386419, -376399, -383934, -388885, -389209, -385129, -389297, -397494, -382977, -402363, -395192, -396701, -394439, -397905, -386515, -391276, -400398, -401233, -411629, -388016, -369718, -367562, -369923, -374840, -369532, -382674, -393057, -385539, -393292, -380869, -375216, -371393, -370343, -383734, -372918, -373867, -379103, -373024, -381107, -375071, -381356, -381082, -373761, -357085, -364437, -356604, -352091, -340390, -335960, -349623, -367434, -373303, -374838, -365491, -374145, -372532, -379876, -371593, -391651, -378011, -382030, -399299, -385900, -382445, -386756, -395684, -386993, -387100, -399688, -387048, -403270, -396179, -383958, -382389, -376725, -368192, -370902, -377001, -367394, -377618, -386205, -378909]
8233c78909j0809J3479n447j6096J4911j974p599M728L985q547J044m266P742
8220c87758k534l726J1165j7631J5991L940r31j551O010p440j2296M821Q464j6479
8206c99955J4784K753j2067J0425K0368k0537o2O282q491q251M573o992J7012
8193c80158o661j6587P671P632N671q744R019j2609m885J0645k138P317q544N036
8179c87335l466M253j5107N840r188J0109K024l94J0969l84M937j4258K031L787
8165c86182k017j84m07J3497j1304j6902J4599j9324J8980j2085J5656n817P39
8152c90751N451l449R14j2333N678R02L316k116O748k81n069P508r042P728j845
8137c86641j1035J6158j6926J4010k765r520J5416m154N652q575O539j941j3914
$$ y = [-378909, -389718, -376239, -381686, -397782, -382871, -384845, -392444, -387716, -383731, -392278, -391234, -395500, -387758, -390292, -394018, -382853, -400484, -384493, -380553, -381484, -383035, -377025, -384465, -396761, -391940, -383476, -399955, -385171, -382418, -394485, -384060, -363692, -384229, -384291, -378009, -386500, -394751, -390178, -397170, -380158, -386819, -403406, -395735, -388103, -382432, -391176, -382157, -394766, -399651, -389006, -391144, -383827, -392371, -387335, -390801, -386548, -401655, -395815, -405003, -394894, -392870, -393264, -382295, -382679, -377742, -392000, -389969, -386182, -388199, -388383, -388790, -375293, -386597, -403499, -388900, -408224, -389244, -401329, -385673, -391490, -390751, -385300, -388749, -387835, -400168, -394490, -393588, -390272, -392388, -385640, -385921, -390990, -383482, -392524, -384796, -386641, -397676, -381518, -398444, -384434, -387199, -396719, -381303, -385457, -379805, -388380, -381841, -383782, -397696]
8124c97696J0384j0860J3452p383N804J2012j5840Q989j4251o509R205l456P265
8111c88884j1336J9155j3929J5239n651j26p012J950O798O342k2775R143L555
8098c87531O15M635j0728K796J807o770J1505j539n307N368M760j783O619k863
8084c78416j3187N493j8m106k418L548L345P256j3532L073P902j912k203J167
8070c84008j2447J1864o572o365N076J0413j1201K789l757J2553k1471J2772J0570
8057c79784p708o993R037L831p189O794j7960K2437L197j0798R614j5748L651
8044c87619j2003J4127L291M781m749Q193j009R650j3199q80j349l437R679k0975
8030c95499J5818m446O209k722j1723J1161J340q023P812p354J2022j5190J4248
$$ y = [-397696, -387312, -398172, -384720, -392103, -386299, -374287, -390127, -381138, -395389, -401898, -392693, -396149, -388884, -400220, -381065, -394994, -379755, -385406, -385532, -392544, -390594, -383796, -377454, -400229, -391086, -387531, -386916, -382281, -393009, -390213, -388406, -395176, -383671, -385210, -390517, -385149, -380389, -382172, -375553, -378416, -391603, -386110, -386128, -390234, -392652, -389104, -385759, -378503, -392035, -388962, -381060, -382972, -385175, -384008, -396455, -384591, -391163, -397528, -392452, -382039, -393240, -390451, -394208, -381655, -403126, -390354, -379784, -387492, -394485, -385448, -381617, -388806, -382012, -399972, -377535, -374338, -385136, -375522, -391270, -387619, -399622, -385495, -382204, -377423, -382172, -373979, -374988, -365338, -378537, -379417, -380766, -384203, -374524, -395499, -379681, -384127, -377918, -380640, -392363, -381202, -379862, -387885, -380073, -387427, -375405, -390595, -376347]
8017c76347J957j4693J2573n853r99n036O441M124o088n673J3655j5408R486p006
8003c88867o419Q222P714o866O910j2107J4487r938j648J1879p485N06N842O13
7989c77157op126J984q230N869q650L175O7m280R706o768R273Q866r193o875M971
7973c84374O093l895M388j7069j145J3194O560J48P17l846j2792R621p29N453
7959c77676r600k654J4869j1306J5045m539p351j130J734o721Q145k70L439q412
7945c86427M432K333M920j6531l596J6618l540q405J2443q999k190n375j140J1567
7931c83890l478N626L381O581j5121q143J2592q32n547l082J146J0299p029p398
7917c94895Q475j187m020Q643j0874J7776o601j0727J4042k384L050k414K481
$$ y = [-376347, -374390, -389083, -376510, -382363, -383362, -388398, -381957, -377833, -383921, -389594, -375939, -391347, -381861, -388867, -395286, -387064, -379350, -386216, -379306, -391413, -376926, -386864, -388512, -376633, -384118, -383612, -377770, -377157, -377163, -384289, -382305, -390535, -384666, -393316, -390141, -390074, -394354, -384648, -391416, -382143, -373277, -382470, -389345, -384374, -378281, -382176, -377788, -394857, -396002, -382808, -376248, -376100, -375383, -379229, -392021, -382400, -383129, -377676, -387276, -389930, -375061, -386367, -371322, -375861, -383212, -384342, -382608, -389329, -381184, -381454, -378015, -386427, -381995, -379662, -374742, -391273, -394869, -378251, -381791, -390196, -377753, -386752, -388942, -394317, -395457, -383890, -387368, -381742, -378361, -371780, -386901, -395044, -382452, -383284, -388831, -391913, -390767, -380468, -387497, -394895, -386420, -387607, -391627, -382984, -393858, -376082, -382683, -393410, -379368, -381752, -378702, -381116, -378635]
7904c78635j1958Q200k10J0189m050k654j1780Q739n912J0462q70L296k503p325
7890c85011J6031n909j4264l65R692p316Q128m32o639J3537o369N205n911m527
7876c84150M178j281J0956j7717o689P353r87k039M794Q837k6691K5037p734J880
7862c84253N09j1526J1020j669l727P0N821l330j710N631q914K3654L169j2146
7848c77401q688J754l465Q085L427j2109L002j621Q104p109l909R208J645k574
7834c81651q603M304K238k255O771o838M345M61O871j264j0181J6738j3300O335
7820c76029j4656N353J309P572j291L625j2138P61N020k368L141J0020m227p376
7806c81284j890j271M352m9K046n391P973p70K632j1497J1069M937k0300J7122
$$ y = [-378635, -390593, -382393, -382603, -372414, -376464, -379118, -390898, -382159, -388071, -377609, -378479, -375183, -377686, -385011, -368980, -374889, -389153, -389518, -379826, -387142, -379014, -379446, -386085, -372548, -378917, -373712, -379623, -384150, -379972, -381253, -370297, -388014, -394703, -387350, -388337, -390376, -385582, -376745, -403436, -378399, -386133, -384253, -383744, -395270, -384250, -385919, -389646, -389576, -383755, -387085, -388795, -383164, -392078, -368424, -365255, -377401, -386089, -384335, -387800, -379715, -376288, -388397, -385395, -387016, -378912, -386021, -389930, -380722, -379077, -381651, -390254, -385950, -383712, -385967, -379196, -386034, -381689, -381228, -374357, -375621, -385802, -369064, -382364, -376029, -390685, -385332, -384023, -376451, -377742, -374117, -386255, -385494, -380474, -382842, -379701, -369681, -373908, -381284, -383174, -384445, -380093, -380142, -378096, -383487, -375514, -376284, -373652, -385149, -374080, -369143, -389443, -372321]
7792c72321p052j1383J6194r054O834J047N712j2963L332K474J2204j7235R475
7779c72736m433K325j2247J0869O231m948j574O658j1927M699n465K388J0549
7766c69611j1983J3962j0406M223j639o954M257K876o447M152K35Q261m771L397
7752c70448q652n353J6761q19o406r16M342l047Q602K242j1988M132p244M727
7738c74067J072j2445O933o468J3540j3041L112J0661q064M593p680P068m490
7725c79276P017l243L986K037m653Q170K045O367q875j0744j533m744L504O020
7711c73922L728j1249L634J414J2706j5482P467J071o280o067r2J9556n376L295
7697c65597p305K175P509o283J0335l511N716j0500K658l764m866R917J798o539
$$ y = [-372321, -379373, -390756, -374562, -383616, -376782, -375735, -370023, -382986, -379654, -377180, -364976, -382211, -372736, -377169, -374844, -387091, -376222, -369991, -374939, -376513, -369855, -381782, -377083, -382548, -380160, -369611, -381594, -367632, -378038, -373815, -375454, -382408, -378151, -375275, -381722, -377570, -377335, -369074, -373845, -370448, -379100, -384453, -367692, -368511, -374917, -375833, -371491, -374538, -365936, -363694, -375682, -371550, -378794, -374067, -372995, -385440, -378507, -384975, -371435, -384476, -381364, -370703, -378767, -374174, -381854, -374786, -379276, -372259, -375502, -371516, -369479, -374132, -365962, -363917, -357550, -366425, -377169, -378702, -383446, -379942, -373922, -370194, -381443, -377809, -376395, -363689, -379171, -371704, -370633, -376913, -382980, -383072, -363516, -368892, -365597, -372902, -370727, -363218, -369501, -359166, -362677, -356961, -367461, -364803, -368567, -373433, -363516, -361718, -368257]
7683c68257j818j309N554J998M429o810k566L056j314P97j0145R851p886Q957
7669c65463p36O005l343m53M795j1299j03n430J2852O338l782l738j1271R53N423
7654c69252l567k810R047j945L217k777K985N638j4619J534R983L70j266o124
7640c69586N836j941j0790J0396M428P270j0689n766J157O197P518j5177Q420
7627c62727l089L56M862n717M608P802k285J218q161M34P136J279m989J356R205
7612c48712r017n816J1693k1088J2397P91R571p027j604Q213p846l094N633L918
7598c51988J8097j3155N865n075q476p622K7527j9486J527J2121r571j0823O141
7585c54918R670r188m85O38p82J2558j1616P229L55J589m560m040j0706R140o653
$$ y = [-368257, -370075, -371384, -365830, -363832, -359403, -366213, -368779, -365723, -367037, -366240, -376385, -366534, -374420, -365463, -366199, -360194, -363537, -363990, -359195, -370494, -370597, -376027, -363175, -356837, -360619, -364357, -375628, -374675, -369252, -372819, -375629, -366582, -368527, -365310, -368087, -365102, -359464, -374083, -372549, -362566, -362196, -363462, -369586, -363750, -365691, -376481, -366085, -361657, -354387, -365076, -370842, -369685, -363488, -355970, -371147, -362727, -365816, -365460, -360598, -366315, -361707, -353905, -356190, -354972, -363133, -362699, -355563, -354284, -359273, -357917, -348712, -357729, -363545, -351852, -372940, -360543, -359752, -350181, -357208, -358812, -350599, -358445, -361539, -355906, -351988, -333891, -347046, -341181, -346256, -354732, -362354, -334827, -354313, -352786, -340665, -350236, -361059, -354918, -345248, -354436, -354921, -354283, -355065, -342507, -354123, -346894, -346539, -344950, -349510, -353550, -364256, -355116, -361769]
7570c61769R054Q69J336o280J055j246J5386j7033Q002O163j3127J7295o068r522
7556c55885p832l19R738P96k0128K4262j2748J08J2179m119j464K848P286m410
7542c49688n737M052p742K2135k4389N295q542J7297m774K32J099R850m651o333
7528c51896k475k347N593R597p160r281J9972n796j0044J5467m574O418k3492
7515c60018P685q07J658P326m802J770j671l527O332P811j3657L118n179j24R93
7500c53092j324P812J7457k6811r60J7112k854l849J042L390K980p435L001M189
7486c39342m79j8573J3509Q956P698j7929J0018m576R231q085J777J553L093j4474
7472c47623k497J3006N769k209R98L82j1674P823O416Q887j2418J035R525j6432
$$ y = [-361769, -352715, -351846, -350510, -356790, -355735, -356981, -341595, -358628, -350626, -344463, -357590, -340295, -346363, -355885, -363717, -364036, -354298, -353502, -373630, -349368, -362116, -362008, -349829, -353948, -355412, -352564, -345278, -349688, -355425, -351373, -359115, -336980, -361369, -356074, -364616, -347319, -352093, -351861, -350762, -340912, -345563, -351896, -354371, -356718, -351125, -341528, -348688, -357969, -337997, -343793, -353837, -338370, -342944, -336526, -360018, -352333, -353140, -351482, -344156, -348958, -347188, -348859, -352386, -346054, -338243, -351900, -348782, -353961, -354085, -353092, -354416, -346604, -329147, -355958, -356918, -339806, -342660, -346509, -345467, -342077, -339097, -346532, -343531, -339342, -339821, -358394, -344885, -335929, -328231, -346160, -336142, -340718, -331487, -339572, -337795, -336242, -333149, -347623, -350120, -337114, -331345, -333554, -332556, -332174, -343848, -336025, -329609, -320722, -333140, -332105, -322580, -339012]
7458c39012J2035j0983L546Q207m407m537N587R396l984K953q878K0277o627o481
7444c22908L683O292o334j84j407J0966J073P377J559j8260J3698Q549Q3L618
7430b92195O311P590J0613l791j5838j2014J0673K529p102M238j0977k351Q771
7417b93543l226m95O805j688q661K229J0867o684P512r437j656Q484j3372J3613
7403b89252L261k0463R514k936N746j4131K4258p472L83l423L65j600P911n302
7389b93141Q328M802j0020Q371J072k423L495m221k010r0m299J6699l761m198
7375b81396O156k854k722q830J2389j1618J1822l527P598m65p781R181J509o340
7361b76878O816k405m802J1940Q066j0487J746j012J086P864M910j6973J4399
$$ y = [-339012, -326977, -337960, -334414, -326207, -330614, -335151, -329564, -320168, -324152, -321199, -330077, -309800, -316427, -322908, -319225, -312933, -319267, -319451, -320858, -309892, -308819, -301442, -299883, -318143, -304445, -295896, -295813, -292195, -285884, -278294, -267681, -271472, -287310, -299324, -288651, -286122, -293224, -288986, -299963, -302314, -293543, -296769, -297264, -290459, -292147, -300808, -298579, -287712, -294396, -286884, -296321, -297977, -289493, -302865, -289252, -285991, -306454, -296940, -299876, -294130, -308261, -284003, -291475, -291092, -294515, -294150, -295750, -287839, -293141, -284813, -280011, -290031, -281660, -280588, -283011, -279516, -283737, -285747, -285837, -290136, -273437, -277198, -281396, -275240, -278094, -280816, -289646, -277257, -288875, -277053, -280580, -272982, -273447, -281228, -272047, -270538, -276878, -270062, -272467, -277269, -265329, -257263, -267750, -266004, -267016, -265930, -258066, -253156, -270129, -255730]
7348b55730O039l203m308M042n144j03K2437o908J2813j467j232M159j300K8174
7334b01731j0611L1537L5313K3374K3957L4326J3375L653k8765k4665j3683n401
7322a19321j6589M395M972J5241J5696K6885M1000L2771j3735l5493l5922l7140
7310a17240k6306j3435n96j7054m739q399n325J1861J811k777j22q971K5651j913
7296a67554J3400k503j1475M085N961o43p905J0843J4212n808l052Q492n239K907
7282a44279P953J5591L559J2652K6408L1777M3379O2342L8065K2352j2664k7163
7270G9972m0056n6447k6815j1724k8387p396n257J2306j3497L188J919r266P736
7257i3724j0836J1119r837m562L296K3555j5561l348J0701k885k430L667J0870
$$ y = [-255730, -249691, -252894, -257202, -253160, -258304, -258407, -235970, -242878, -230065, -231532, -232764, -228605, -229905, -201731, -212342, -180805, -145492, -122118, -98161, -63835, -50460, -46807, -75572, -100237, -113920, -119321, -135910, -131515, -126543, -111302, -95606, -68721, -27721, 5050, -8685, -44178, -80100, -117240, -143546, -156981, -157577, -174631, -179370, -187769, -193094, -181233, -179422, -182199, -182321, -191292, -165641, -167554, -154154, -156657, -168132, -164047, -158086, -158729, -166634, -155791, -141579, -147387, -150439, -141947, -147186, -144279, -136326, -120735, -117176, -104524, -78116, -46339, -2960, 59382, 97447, 119799, 107135, 79972, 39916, -16531, -43346, -55070, -83457, -90853, -96110, -83804, -97301, -94113, -92194, -101460, -93724, -104560, -93441, -103278, -107840, -104544, -80989, -96550, -99898, -89197, -92082, -94512, -90845, -79975]
7244g9975n539J1268n342L724J54M712J2353l469K940J0898j417K331j450J5480
7230c3332j545J0295j715R91P57Q543K521R436J4121L213N017n367J2825P687
7216C3447R59N062R763N215p5J1990L286J3156K937O844j202J4175O718K858J542
7201A16675J0406J8992P562p365L0486J910Q522j601J2243j0664J4645R619L54
7188B11784J6523O176O541k837K0546J6816N700N795O075J9136J1013O924K620
7175C32812J1943J996K5639J3837J0155J8536J3946K1253K1809O507K4286K3140
7163E25859J3092L0806K3424L4156L2659K1623M0705M1193P7326Q9504J82423
7152A112770K21744K48316J86388N8426q931l922N3748P0770m839j20185j80623
$$ y = [-79975, -85514, -74246, -79588, -75864, -75710, -70998, -58645, -62114, -59174, -48276, -49693, -47362, -48812, -33332, -34877, -24582, -26297, -25306, -24549, -16006, -13485, -4049, 10072, 13285, 18302, 12935, 25760, 33447, 34406, 39468, 49231, 54446, 54371, 66361, 69647, 82803, 85740, 92584, 91382, 105557, 112275, 115133, 116675, 127081, 146073, 153635, 146270, 176756, 178666, 187188, 185587, 197830, 187166, 201811, 211430, 211784, 228307, 234483, 241024, 238187, 258733, 275549, 281249, 287044, 293119, 312255, 323268, 330192, 332812, 344755, 346751, 372390, 386227, 396382, 414918, 428864, 450117, 471926, 478433, 502719, 525859, 538951, 569757, 593181, 627337, 659996, 681619, 722324, 763517, 840843, 930347, 1112770, 1334514, 1582830, 1769218, 1827644, 1818713, 1814791, 1868539, 1939309, 1934470, 1814285, 1633662]
7141A633662k00147j48604j01361o8664l4025j9806l391j1273J9097J3457J1410
7130A090355J4847L701K7256K4780J7304L3567K3916L6577J6513K1563L9115L1999
7118A381493L1967L5653N1040L8524L5953L3766L9931M0575M9569L0930M7124
7107A816525M8527N7450N6286N3869M9285O3711N6703P0118N8067P8791N5370
7096B464702Q7338P1385O8942R6534Q0418P9566J07820R1606J08457J05741J01856
7085C464365J22957J28688J15117J36079J41585J33746J59282J66974J66459J85282
7075D920534J93761J94348K14437K34429K44485K49819K75140L15263L52570M22675
7065G617461M57751M56357L80023K48713J38538J17380J15533J19170J82404K26298
$$ y = [1633662, 1433515, 1284911, 1183550, 1114886, 1080861, 1061055, 1057664, 1046391, 1065488, 1078945, 1090355, 1105202, 1108903, 1136159, 1160939, 1178243, 1211810, 1235726, 1272303, 1288816, 1310379, 1349494, 1381493, 1413460, 1449113, 1500153, 1538677, 1574630, 1608396, 1648327, 1688902, 1738471, 1769401, 1816525, 1865052, 1922502, 1978788, 2032657, 2081942, 2145653, 2202356, 2272474, 2330541, 2409332, 2464702, 2552040, 2623425, 2692367, 2788901, 2869319, 2948885, 3056705, 3148311, 3256768, 3362509, 3464365, 3587322, 3716010, 3831127, 3967206, 4108791, 4242537, 4401819, 4568793, 4735252, 4920534, 5114295, 5308643, 5523080, 5757509, 6001994, 6251813, 6526953, 6842216, 7194786, 7617461, 8075212, 8531569, 8911592, 9160305, 9298843, 9416223, 9531756, 9650926, 9833330, 10059628]
7055A0059628K40742K82272K70127K87554K94701K94811K86931K87312K73512
7046A2577590K53426K39841K05859J96359J53075J37027Q8928N4931O969l7301
7036A3876704q5987j02985j45367j80535k00915k41747k64278k74763k78811l12458
7026A1788858l35861l21191l20899l30070l24585l25966l11528l28221k85322
7017H905215l01632l00835k90356k92411k63583k50617k46957k29690k27589k01687
7007F299858j95359j72855j83482k00068k02336j71375j87973j64682j63479j44919
6997D513330j20133j30814j42645j36619j30507r5624j20100j04774r5601r1359
6987C345154r2900p2123p0035o2055p8105o9563r7196r6407q4797q6928o1760
$$ y = [10059628, 10300370, 10582642, 10852769, 11140323, 11435024, 11729835, 12016766, 12304078, 12577590, 12831016, 13070857, 13276716, 13473075, 13626150, 13763177, 13852105, 13907036, 13914005, 13876704, 13790717, 13687732, 13542365, 13361830, 13160915, 12919168, 12654890, 12380127, 12101316, 11788858, 11452997, 11131806, 10810907, 10480837, 10156252, 9830286, 9518758, 9190537, 8905215, 8603583, 8302748, 8012392, 7719981, 7456398, 7205781, 6958824, 6729134, 6501545, 6299858, 6104499, 5931644, 5748162, 5548094, 5345758, 5174383, 4986410, 4821728, 4658249, 4513330, 4393197, 4262383, 4119738, 3983119, 3852612, 3756988, 3636888, 3532114, 3436513, 3345154, 3252254, 3180131, 3110096, 3048041, 2969936, 2900373, 2803177, 2706770, 2621973, 2535045, 2473285]
6976B473285o8546n5435n3021n7150n6389n1056o1397n7018n3099m5068m6985
6965A868121l4484m4475k1813o9965l3030l9968n0736k6689l3338k5673k3021
6954A464929k3541m281l0143O986R499N306M5857J12896K22796K13727m4192k46323
6942A733516k16779j33806j10503r1029m5467m5317n4236l5825j7549k4637l2404
6931I25964j9515j162k7305j2024o562k1205j9317J2074r45o303j5728P076j0184
6918H04864q456o440j2296j8522j7743o927k1297k0954k4042o190l2983J1508
6906F40522k2458l831o302r502j0466j8552P456k3196k1077k815k689l1349J4692
6893E10433j0677R802n024j0081l668L335l881j106p33R337L270K9329M0092J9034
$$ y = [2473285, 2404739, 2349304, 2296283, 2239133, 2182744, 2131688, 2070291, 2013273, 1960174, 1915106, 1868121, 1833637, 1789162, 1767349, 1697384, 1664354, 1624386, 1573650, 1546961, 1513623, 1487950, 1464929, 1441388, 1437107, 1406964, 1413950, 1423449, 1428755, 1474612, 1587508, 1810304, 2024031, 1979839, 1733516, 1516737, 1382931, 1272428, 1181399, 1135932, 1090615, 1036379, 1000554, 983005, 958368, 925964, 906449, 905287, 877982, 865958, 859396, 838191, 818874, 830948, 830003, 823700, 807972, 815048, 804864, 796408, 789968, 777672, 759150, 741407, 734480, 713183, 692229, 668187, 661997, 629014, 640522, 618064, 614233, 607931, 598429, 587963, 569411, 576867, 553671, 532594, 529779, 527090, 495741, 510433, 499756, 509558, 504534, 494453, 490785, 494120, 490239, 489133, 488400, 497737, 501007, 530336, 570428, 589462]
6879E89462p264p795l2351m9472k6308k9116j8793k7260j5217k2088L629j0522
6867C46905k2097K970j2129J2638n761q843R16Q80o159J591n870K0811K637r261
6853C19228K338n942J2621n62O234K829M364L288Q707j791M879J7062O635K5060
6839D04950J5131J0794J6562K2045J8674L6401M1385P3551Q2726J05781J08165
6828I36165R7537O8708M4628N80m1105n5719o3101o1119o2448o5815m9119o2516
6816F86676k5366n2026l5921l1882j4055r451m7750j0436j2591j6672j8270j3673
6804C98583M840j2421j4735K052J8833r858q006MR321O068J049K2812J5468J8243
6790D52253K4347L4768K6137K2880k0123l8788k6676j0429j2144j0821k3552r662
$$ y = [589462, 582198, 574403, 542052, 492580, 466272, 437156, 418363, 391103, 375886, 353798, 357427, 346905, 324808, 327778, 315649, 328287, 322526, 313683, 314599, 315479, 309320, 310911, 305041, 325852, 328489, 319228, 321566, 315624, 328245, 327683, 333917, 336746, 341110, 344398, 353105, 351314, 356193, 373255, 379890, 404950, 420081, 430875, 447437, 469482, 488156, 524557, 565942, 639493, 722219, 828000, 936165, 1033702, 1102410, 1147038, 1147618, 1106513, 1050794, 987693, 926574, 864126, 798311, 749192, 686676, 661310, 609284, 573363, 541481, 527426, 517975, 470225, 459789, 447198, 430526, 412256, 398583, 403423, 391002, 376267, 378319, 397152, 387294, 379288, 379292, 388613, 394681, 395730, 418542, 434010, 452253, 476600, 511368, 537505, 560385, 540262, 501474, 474798, 464369, 452225, 441404, 417852, 408190]
6778D08190j6164K163m410o034O182J0468J2280k4823M0611j5194Q86R78P564
6765D22697m90J5661r118J0592R010J9366j424J339J2793K3915r741n848J7328
6752E06080J3481K450j428J38L367o41R212K2610j571K0955K1423J3349J0076
6739F19501K6765N856J0852J3698J337K3034J159Q975J7289J8388K3497p993R985
6726G72343J2948P522K5821P546J2983K9736K3296J1800L5554K2834R551J4703
6714I86637K8620J8336K5910P212K7519K3690J9207L0899M4913J9419L4730L0683
6702A297775L4465P4463N1565N4035L780J3275K0778N903L9644L8501L7491K5221
6690A696896O8442M4154O3905N4390N6502N4482O2790O9537O4735O8049N9377
$$ y = [408190, 392026, 394189, 389779, 383745, 389927, 400395, 412675, 387852, 428463, 413269, 414155, 415133, 422697, 422207, 437868, 428750, 439342, 448352, 467718, 466294, 467633, 480426, 504341, 494600, 488752, 506080, 519561, 522011, 520583, 520721, 524088, 523447, 532659, 555269, 553698, 574653, 596076, 609425, 619501, 646266, 652122, 662974, 676672, 678009, 701043, 702202, 711177, 728466, 746854, 770351, 762358, 772343, 785291, 792813, 818634, 826180, 839163, 868899, 892195, 903995, 939549, 962383, 971934, 986637, 1015257, 1033593, 1059503, 1066715, 1094234, 1117924, 1137131, 1168030, 1212943, 1232362, 1267092, 1297775, 1332240, 1406703, 1458268, 1512303, 1516083, 1529358, 1550136, 1556039, 1595683, 1634184, 1671675, 1696896, 1765338, 1809492, 1873397, 1927787, 1984289, 2038771, 2101561, 2171098, 2235833, 2303882, 2363259]
6679B363259O6471O2521N6660P1708O2394Q8938R5519Q6402J10042J05869J49955
6668C319738J76363J79075J44666J00193P5636Q6437R8706J31788J57193J54731
6658D624526J70551J70483K15011K15388K33492K61592K74733K98985L29547L38487
6648G132795L72595M03718M47792N03756N29090N69094O10122O73229P34158Q03448
6638A2779797Q86664R74338J073633J226906J325045J398957J557004J721435
6630B2943779J914103K108032K319360K556187K729722K899243K987422K967378
6622D3425226K745310K344132J734728R13081J4506q95761j678208k293576k718617
6613D3590821k930207k973433k917919k748051k571210k352116k127484j926893
$$ y = [2363259, 2429730, 2492251, 2548911, 2620619, 2683013, 2771951, 2867470, 2953872, 3063914, 3169783, 3319738, 3496101, 3675176, 3819842, 3920035, 3995671, 4082108, 4180814, 4312602, 4469795, 4624526, 4795077, 4965560, 5180571, 5395959, 5629451, 5891043, 6165776, 6464761, 6794308, 7132795, 7505390, 7909108, 8356900, 8860656, 9389746, 9958840, 10568962, 11242191, 11976349, 12779797, 13666461, 14640799, 15714432, 16941338, 18266383, 19665340, 21222344, 22943779, 24857882, 26965914, 29285274, 31841461, 34571183, 37470426, 40457848, 43425226, 46170536, 48514668, 50249396, 51162477, 51176983, 50281222, 48603014, 46309438, 43590821, 40660614, 37687181, 34769262, 32021211, 29450001, 27097885, 24970401, 23043508]
6605B3043508j741097j551636j410026j269937j140272j059648r65805q82651
6597A3022436p94858p19995o59354n90517n46178m82459m71776m24745l80490
6588G952064l63542l46136l12028k79178k81659k71591k33101k27368k04682k09865
6578E222914k13070j96015j79485j64578j48529j46715j49330j40686j23170j20770
6568C640566j12546j00040r9712r5007r1646r2664o9589p6103o1672p1989n1951
6557B717647m1213m0439l1599l1516m8619n0170p2073o5171p8570p3620o8304
6546B116353o0364m5809m6452k0819m4156k4883k9612k4566m3589l0471l0710
6535A714922k8442k9322k6785m1212k4743j4164k7208l8109q230k8113l1185m815
$$ y = [23043508, 21302411, 19750775, 18340749, 17070812, 15930540, 14870892, 13905087, 13022436, 12227578, 11507583, 10848229, 10257712, 9711534, 9229075, 8757299, 8332554, 7952064, 7588522, 7242386, 6930358, 6651180, 6369521, 6097930, 5864829, 5637461, 5432779, 5222914, 5009844, 4813829, 4634344, 4469766, 4321237, 4174522, 4025192, 3884506, 3761336, 3640566, 3528020, 3427980, 3328268, 3233261, 3141615, 3048951, 2979362, 2903259, 2841587, 2769598, 2717647, 2676434, 2635995, 2604396, 2572880, 2524261, 2474091, 2402018, 2336847, 2258277, 2184657, 2116353, 2055989, 2010180, 1963728, 1942909, 1898753, 1873870, 1844258, 1819692, 1776103, 1745632, 1714922, 1686480, 1657158, 1630373, 1589161, 1564418, 1550254, 1523046, 1484937, 1476707, 1448594, 1417409, 1412594]
6523A412594k0787m531k5675M840j5382k2209K823j5163o459J3706j3103Q465
6511A319119Q401Q727L337J4861R571K4934L5842M9832O7507L5927M5741M3076
6499A666875n647K122l5208l1076q543l4778j5390N311o557J1883L2774L4442
6487A616208N0018N8045O1688R1117Q5881J31747J56992K05409K83417L76787
6477C117309N28444O36425N75316K38103j58323l56367l82533l07931k29520j25096
6467C535827o2003L6860Q6820J28695K06321K81938L95308N53655P47876R94302
6457F905599J075124Q68384O60569P20012R52363R08264K82017n60783r50595
6448A0860954p61500l59460J21157L08020p0655n73674o70676m85481k23176N4694
$$ y = [1412594, 1391807, 1387276, 1361601, 1366441, 1351059, 1328850, 1331673, 1316510, 1310051, 1323757, 1310654, 1319119, 1327520, 1336247, 1339584, 1354445, 1364016, 1388950, 1424792, 1474624, 1542131, 1578058, 1623799, 1666875, 1661228, 1663350, 1628142, 1597066, 1588523, 1553745, 1538355, 1543666, 1537109, 1548992, 1581766, 1616208, 1666226, 1724271, 1785959, 1877076, 1962957, 2094704, 2251696, 2457105, 2740522, 3117309, 3645753, 4282178, 4857494, 5095597, 4937274, 4580907, 4198374, 3890443, 3660923, 3535827, 3473824, 3510684, 3597504, 3726199, 3932520, 4214458, 4609766, 5163421, 5911297, 6905599, 7980723, 8849107, 9509676, 10229688, 11182051, 12090315, 12372332, 11811549, 10860954, 10099454, 9739994, 9861151, 10169171, 10098516, 9524842, 8854166, 8368685, 8145509, 8200203]
6438H200203L60751P40496J133144J452005J380220Q26093J99836K3120K84778
6429A4600646N93597O03858M02321r1424n23022l79855K06251N74114r6430j409253
6419A4480803j888525j585436j139239p34317l54476L276L43112N89762N98343
6410A0313303L34275N06o1680K35134O92826J190374J308285O00375n12569j003569
6400A3097260q00964o22280q48231j247492j303403j110651q54683o17787m34179
6391E257590k76074k05513j38249m5521N1470J11784K07164L70848N65068P45832
6381F644399O34349J93956l49820o84260p53349o76840o01752m86131m03038l05213
6371C212301k26573j90202j52978j18891r9530o7675n2299k3057m7724n0844q4366
$$ y = [8200203, 8560954, 9301450, 10434594, 11886599, 13266819, 14092912, 14292748, 14315868, 14600646, 15194243, 15798101, 16200422, 16108998, 15585976, 15206121, 15412372, 15986486, 15890056, 14480803, 12592278, 11006842, 9867603, 9133286, 8778810, 8782086, 9125198, 9714960, 10313303, 10647578, 10648084, 10586404, 10821538, 11514364, 12704738, 14013023, 14613398, 14100829, 13097260, 12296296, 11674016, 10825785, 9578293, 8274890, 7164239, 6309556, 5691769, 5257590, 4981516, 4776003, 4637754, 4592233, 4643703, 4755487, 4962651, 5333499, 5898567, 6644399, 7278748, 7472704, 7122884, 6438624, 5685275, 5008435, 4406683, 3920552, 3517514, 3212301, 2985728, 2795526, 2642548, 2523657, 2424127, 2356452, 2304153, 2281096, 2233372, 2182528, 2098162]
6360B098162l6414l0227m297j6338l6708j8704l4570n1342k0646k8687j9422j191
6348A799616Q304J8104L2311L4728J4615L3798J0684L1517J3551K9284L3173J4229
6336B073914M2349J677K5337M6302O2457O9015Q4077J29968J67899K22331K56242
6325C181568K38589J80635R4755q762q4595j13120j09507o7639k0982J9528N8738
6314C369208Q9878R4241R5090J06746J15274J44117J80577K43059K84626L23911
6304E046727L80360M30825N35150O43447P59986Q60754J032165J332977J887526
6295A2909917K829987M452020O547149P903462O431775J887083k880483n581456
6287C4499454o292753n695859m532901l270602k265970j572227j118579r05662
$$ y = [2098162, 2061748, 2031521, 2027224, 2010886, 1974178, 1955474, 1920904, 1869562, 1848916, 1820229, 1800807, 1799616, 1807920, 1826024, 1858335, 1893063, 1907678, 1941476, 1952160, 1983677, 1997228, 2026512, 2059685, 2073914, 2116263, 2117940, 2143277, 2189579, 2252036, 2321051, 2405128, 2535096, 2702995, 2925326, 3181568, 3420157, 3600792, 3695547, 3686785, 3602190, 3489070, 3379563, 3311924, 3290942, 3310470, 3369208, 3459086, 3553327, 3648417, 3755163, 3870437, 4014554, 4195131, 4438190, 4722816, 5046727, 5427087, 5857912, 6393062, 7036509, 7796495, 8657249, 9689414, 11022391, 12909917, 15739904, 20191924, 26739073, 34642535, 41074310, 42961393, 40080910, 34499454, 28206701, 22510842, 17977941, 14707339, 12441369, 10869142, 9750563, 8844901]
6279H844901p01552n57563m66038l74929l18423k37518j91368j44945j09336o2569
6269E680660K815N2536J13675J18022J35528J33276J38286J42066J85386K27424
6259F929674K66070L18626L85766M32994M60812N42544O06029P22341Q18465R99879
6249A2483200J251961J503194J763706K037623K445870L151975M401585O537714
6241C5576828R805118J3628548J5857398J3252090N284918m095367j0558451j3114297
6233F5636785j2758337j0745924q213420n955188m289395l174369k464337k001313
6225A6034502j666410j366719j078844r11064p18952n95589m74233l71614k75722
6216H575355j59303p193J33535J58660Q983j89799l27558l73322l50152k86505
$$ y = [8844901, 8143349, 7585786, 7119748, 6744819, 6426396, 6188878, 5997510, 5852565, 5743229, 5680660, 5683475, 5736011, 5849686, 5967708, 6103236, 6236512, 6374798, 6516864, 6702250, 6929674, 7195744, 7514370, 7900136, 8333130, 8793942, 9336486, 9942515, 10664856, 11483321, 12483200, 13735161, 15238355, 17002061, 19039684, 21485554, 24637529, 29039114, 35576828, 45381946, 59010494, 74867892, 88119982, 93404900, 89309533, 78751082, 65636785, 52878448, 42132524, 33919104, 27963916, 23674521, 20500152, 18035815, 16034502, 14368092, 13001373, 11922529, 11011465, 10292513, 9696924, 9222691, 8851077, 8575355, 8416052, 8408859, 8542394, 8701054, 8710037, 8520238, 8192680, 7819358, 7469206, 7182701]
6206G182701k05767j29755r1878l4769n7262n8323l6334o483j1619K4654M8825
6195F623990J02240J21710J50041J74389K02179K77946L42385M23184M10548M18395
6185I247007M54408M21708L53562M17920N62779P73857J009495J309755J684737
6176A6235228K304484L293123M182981K958968L39127l86453L78221J443522K841497
6167C3590698M983169Q292711J2930247J7172274J6454576P960947l532753j1412049
6159H6439820j4002607j2690486r332050n577776m112049n187203n372122m318748
6151B5846779l334742k557740j941937j457173j119349q62785o72309n23832l69331
6142A3007581k63081j50920q951J47652L06005N20589P45024J075440J528125
$$ y = [7182701, 6976934, 6847179, 6755301, 6720532, 6663270, 6604947, 6568613, 6562130, 6550511, 6575165, 6623990, 6726230, 6847940, 6997981, 7172370, 7374549, 7652495, 7994880, 8418064, 8828612, 9247007, 9701415, 10123123, 10476685, 10894605, 11457384, 12231241, 13240736, 14550491, 16235228, 18539712, 21832835, 26015816, 28974784, 29313911, 28927458, 29305679, 30749201, 33590698, 38573867, 46866578, 59796825, 76969099, 93423675, 101384622, 97851869, 86439820, 72437213, 59746727, 50414677, 44836901, 40724852, 35537649, 30165527, 25846779, 22512037, 19954297, 18012360, 16555187, 15435838, 14573053, 13900744, 13376912, 13007581, 12744500, 12593580, 12584629, 12732281, 13038286, 13558875, 14303899, 15379339, 16907464]
6133A6907464K389151L936521O360998Q101597M572411k678598n821020n162015
6125B8606509l801068k599540j624203q65300l41467P9532M32796Q35079J305442
6116B2027780J976140L067343N071779Q270573J1824769J1711826O201841n92426
6108F9559625o189647r329187r789038q544702o630711m702200l243903k217216
6100A8913021j532857j118717p58645m32102p8763K78182P63034J460631K697813
6091B0191597M681819O778887N882181R7247m945948n835239m826723l674055
6083A8349766k685481j879802j309966r27783o79580m80663l47239j79008l8002
6074I822242J42658L07789N61724Q56821J262291K059889L449958N453082O288282
$$ y = [16907464, 19296615, 23233136, 29594134, 37695731, 42268142, 39589544, 33768524, 28606509, 24805441, 22205901, 20581698, 19716398, 19374931, 19454463, 19887259, 20722338, 22027780, 24003920, 27071263, 32143042, 40413615, 52238384, 63950210, 70152051, 69559625, 63369978, 54040791, 44251753, 35707051, 29076340, 24374140, 21130237, 18913021, 17380164, 16261447, 15502802, 15070700, 14991937, 15270119, 16033153, 17493784, 20191597, 24873416, 31652303, 37534484, 37631731, 32685783, 26850544, 22023821, 18349766, 15664285, 13784483, 12474517, 11546734, 10867154, 10386491, 10039252, 9860244, 9822242, 9964900, 10272689, 10834413, 11691234, 12953525, 15013414, 18463372, 23916454, 30204736]
6065C0204736K440737l380950n523102m808240l649845k626024j814640j259729
6057I582943q82132o73960m99606m18271l10402j49823Q992J54203L41860P57634
6047G911438J513010K566232K564310K4478k153216k295018j756164j291618r37837
6038F145615o40618m45349l42738k55481j87328j33093p8593l7147M0251J01323
$$ y = [30204736, 32645473, 29264523, 23741421, 18933181, 15283336, 12657312, 10842672, 9582943, 8700811, 8026851, 7527245, 7108974, 6798572, 6648749, 6657741, 6811944, 7153804, 7911438, 9424448, 11990680, 14554990, 14579468, 12426252, 10131234, 8375070, 7083452, 6145615, 5504997, 5059648, 4716910, 4461429, 4274101, 4141008, 4062415, 4025268, 4065519, 4166842]
$$ [...]
##END NTUPLES=NMR SPECTRUM
##END=
