##TITLE=abcd
##JCAMPDX= 6.0         $$ Bruker NMR JCAMP-DX V2.0
##DATA TYPE= NMR SPECTRUM
##DATA CLASS= NTUPLES
##ORIGIN= UXNMR, Bruker Analytische Messtechnik GmbH
##OWNER= root
$$ XWIN-NMR		Version 3.5
$$ Fri Nov 28 18:35:35 2025 Russian Standard Time (UT+4h)  servis@DPX200
##.OBSERVE FREQUENCY= 200.131235884673
##.OBSERVE NUCLEUS= ^1H
##.ACQUISITION MODE= SIMULTANEOUS
##.ACQUISITION SCHEME= undefined
##.AVERAGES= 32
##.DIGITISER RES= 18
##SPECTROMETER/DATA SYSTEM= spect
##.PULSE SEQUENCE= zg
##.SOLVENT NAME= CDCl3
##.SHIFT REFERENCE= (INTERNAL, CDCl3, 0, 16.4885)
##AUDIT TRAIL= $$ (NUMBER, WHEN, WHO, WHERE, WHAT)
$$ ##TITLE= Audit trail, XWIN-NMR		Version 3.5
$$ ##JCAMPDX= 5.01
$$ ##ORIGIN= Bruker BioSpin GmbH
$$ ##OWNER= servis
$$ F:\spectra/data/av/nmr/H1/1/pdata/1/auditp.txt
$$ ##AUDIT TRAIL=  $$ (NUMBER, WHEN, WHO, WHERE, WHAT)
(   1,<2025-11-28 18:33:36.07 +0400>,<servis>,<DPX200>,
      <created by zg, POWCHK disabled, PULCHK disabled
       configuration hash MD5:
       00 E9 B6 7A A2 85 ED C7 34 08 36 98 17 FE 4E 26
       data hash MD5: 32K
       C6 DF 4C 53 40 06 32 00 FF 24 AB 02 24 7F 38 38>)
(   2,<2025-11-28 18:34:49.57 +0400>,<servis>,<DPX200>,
      <Start of raw data processing
       efp BC_mod = 2 LB = 0.05 FT_mod = 6 PKNL = 1 PHC0 = -261.6425 PHC1 = 6.301564 SI = 16K 
       data hash MD5: 16K
       D5 03 6C 15 1E 38 99 D8 0F 30 6D D8 FA 31 82 26>)
(   3,<2025-11-28 18:34:59.54 +0400>,<servis>,<DPX200>,
      <pk PHC0 = -3 PHC1 = 0 
       data hash MD5: 16K
       3E 61 25 E3 19 24 25 19 6B 10 CB 40 2A D5 80 57>)
(   4,<2025-11-28 18:35:01.35 +0400>,<servis>,<DPX200>,
      <abs ABSG = 5 
       data hash MD5: 16K
       48 3D 34 D9 81 A9 7E 89 E1 53 B3 AC 21 2A 4B 99>)
(   5,<2025-11-28 18:35:12.54 +0400>,<servis>,<DPX200>,
      <pk PHC0 = 0.8 PHC1 = 0 
       data hash MD5: 16K
       2C 50 A4 33 75 0A B3 E2 61 71 84 93 93 A8 F3 7F>)
$$ ##END=
$$ 
$$ hash MD5
$$ 61 5D C7 E3 4C FD DA 10 27 65 26 86 DC A0 4F A8
##$RELAX= 
##$RELAX= 
##$RELAX= 
##$RELAX= 
##$RELAX= 
##$RELAX= 
##$RELAX= 
##$RELAX= 
$$ Bruker specific parameters
$$ --------------------------
##$DU= <F:\spectra>
##$EXPNO= 1
##$NAME= <H1>
##$PROCNO= 1
##$TYPE= <nmr>
##$USER= <av>
##$AMP= (0..31)
100 100 100 100 100 100 100 100 100 100 100 100 100 100 100 100 100 100 
100 100 100 100 100 100 100 100 100 100 100 100 100 100 
##$AQSEQ= 0
##$AQ_mod= 1
##$AUNM= <au_zg>
##$AUTOPOS= <>
##$BF1= 200.13
##$BF2= 200.13
##$BF3= 200.13
##$BF4= 200.13
##$BF5= 500.13
##$BF6= 500.13
##$BF7= 500.13
##$BF8= 500.13
##$BYTORDA= 1
##$CFDGTYP= 0
##$CFRGTYP= 5
##$CHEMSTR= <none>
##$CNST= (0..31)
1 1 145 1 1 1 1 1 1 1 1 1 1 1 1 1 1 1 1 1 1 1 1 1 1 1 1 1 1 1 1 1 
##$CPDPRG= <>
##$CPDPRG1= <>
##$CPDPRG2= <>
##$CPDPRG3= <>
##$CPDPRG4= <mlev>
##$CPDPRG5= <mlev>
##$CPDPRG6= <mlev>
##$CPDPRG7= <mlev>
##$CPDPRG8= <mlev>
##$CPDPRGB= <>
##$CPDPRGT= <>
##$D= (0..31)
0 2 0 0 0 0 0 0 0 0.06 0 0 0 0 0 0 0.0002 0 0 0 0 0 0 0 0 0 0 0 0 0 0 
0 
##$DATE= 1764340415
##$DBL= (0..7)
$$ [...]
##$SUBNAM5= <"">
##$SUBNAM6= <"">
##$SUBNAM7= <"">
##$SUBNAM8= <"">
##$SUBNAM9= <"">
##$SW= 20.6817932712277
##$SWIBOX= (0..15)
0 0 3 0 0 0 0 0 0 0 0 0 0 0 0 0 
##$SW_h= 4139.07284768212
##$TD= 32768
##$TD0= 1
##$TE= 0
##$TE2= 300
##$TE3= 300
##$TEG= 300
##$TL= (0..7)
0 120 120 120 120 120 120 120 
##$TP= (0..7)
150 150 150 150 150 150 150 150 
##$TP07= 0
##$TPNAME0= <>
##$TPNAME1= <>
##$TPNAME2= <>
##$TPNAME3= <>
##$TPNAME4= <>
##$TPNAME5= <>
##$TPNAME6= <>
##$TPNAME7= <>
##$TPOAL= (0..7)
0.5 0.5 0.5 0.5 0.5 0.5 0.5 0.5 
##$TPOFFS= (0..7)
0 0 0 0 0 0 0 0 
##$TUNHIN= 0
##$TUNHOUT= 0
##$TUNXOUT= 0
##$USERA1= <user>
##$USERA2= <user>
##$USERA3= <user>
##$USERA4= <user>
##$USERA5= <user>
##$V9= 5
##$VALIST= <valist>
##$VCLIST= <CCCCCCCCCCCCCCC>
##$VD= 0
##$VDLIST= <DDDDDDDDDDDDDDD>
##$VPLIST= <PPPPPPPPPPPPPPP>
##$VTLIST= <TTTTTTTTTTTTTTT>
##$WBST= 1024
##$WBSW= 30
##$XGAIN= (0..3)
0 0 0 0 
##$XL= 0
##$YL= 0
##$YMAX_a= 1413847
##$YMIN_a= -1051410
##$ZGOPTNS= <>
##$ZL1= 120
##$ZL2= 120
##$ZL3= 120
##$ZL4= 120
##$ABSF1= 16.48848
##$ABSF2= -4.193441
##$ABSG= 5
##$ABSL= 3
##$ALPHA= 0
##$AQORDER= 0
##$ASSFAC= 0
##$ASSFACI= 0
##$ASSFACX= 0
##$ASSWID= 0
##$AUNMP= <proc_1d>
##$AZFE= 0.1
##$AZFW= 0.1
##$BCFW= 0
##$BC_mod= 2
##$BYTORDP= 0
##$COROFFS= 0
##$CY= 18.4799938201904
##$DATMOD= 1
##$DC= 0
##$DFILT= <>
##$DTYPP= 0
##$F1P= 9.9274215381318
##$F2P= -0.165520771350173
##$FCOR= 1
##$FTSIZE= 16384
##$FT_mod= 6
##$GAMMA= 0
##$GB= 0
##$INTBC= 1
##$INTSCL= 4.127829e-11
##$ISEN= 128
##$LB= 0.05
##$LEV0= 0
##$LPBIN= 0
##$MAXI= 10000
##$MC2= 0
##$MEAN= 0
##$ME_mod= 0
##$MI= 50
##$NCOEF= 0
##$NC_proc= -5
##$NLEV= 6
##$NOISF1= 3.799351
##$NOISF2= 2.8
##$NSP= 0
##$NTH_PI= 0
##$NZP= 0
##$OFFSET= 16.48848
##$PC= 4
##$PHC0= -263.8425
##$PHC1= 6.301564
##$PH_mod= 1
##$PKNL= yes
##$PPARMOD= 0
##$PSCAL= 4
##$PSIGN= 0
##$REVERSE= no
##$SF= 200.130005582386
##$SI= 16384
##$SIGF1= 3
##$SIGF2= 2
##$SINO= 400
##$SIOLD= 16384
##$SREGLST= <1H.CDCl3>
##$SSB= 0
##$STSI= 16384
##$STSR= 0
##$SW_p= 4139.07284768211
##$SYMM= 0
##$S_DEV= 0
##$TDeff= 32768
##$TDoff= 0
##$TI= <>
##$TILT= no
##$TM1= 0
##$TM2= 0
##$TOPLEV= 0
##$USERP1= <user>
##$USERP2= <user>
##$USERP3= <user>
##$USERP4= <user>
##$USERP5= <user>
##$WDW= 1
##$XDIM= 16384
##$YMAX_p= 417493290
##$YMIN_p= -485716
$$ End of Bruker specific parameters
$$ ---------------------------------
##NTUPLES= NMR SPECTRUM
##VAR_NAME=  FREQUENCY,     SPECTRUM/REAL,   SPECTRUM/IMAG
##SYMBOL=    X,             R,               I
##VAR_TYPE=  INDEPENDENT,   DEPENDENT,       DEPENDENT
##VAR_FORM=  AFFN,          ASDF,            ASDF
##VAR_DIM=   16384,         16384,           16384
##UNITS=     HZ,            ARBITRARY UNITS, ARBITRARY UNITS
##FACTOR=    0.252644378177508, 1,           1
##FIRST=     3299.83951724647, 0,            0
##LAST=      -839.233330435636, 0,           0
##MIN=       -839.233330435636, -485716,     0
##MAX=       3299.83951724647, 417493290,    0
$$ Real data points
##PAGE= N=1
##DATA TABLE= (X++(R..R)), XYDATA
$$ [...]
10051a42305K3647Q9342j91192O4994l5069n226Q5108q1450J73272j88276R1061
10040a16094j1310l6985J9594P2907N8770j48888o84P2815k6852O505p5596O2301
10028a23517Q0976m3467n3704N051j9854N1226J117o9220j4039J6133O5286j30100
10016b34112Q4077n2334n7066J24982M9352k9448m6571p1919J1843M6588J34379
10005d0229r7139J2113O5320n0073l8524L175p8309J59757j36388L6218P3446
9994i0633j1465P2883k29928M6153J41973r3612K0896k6108j7689J7706L0210
9983a39614m6415J6351q7796J68435o2832J23152j90422R1057R3201j08455Q3536
9972e9802k6740j18443J01575n5782O7760j04937O762j7490O0530J91l1339M6195
$$ y = [-142305, -118658, -29316, -220508, -155514, -190583, -195809, -110701, -192151, -18879, -207155, -116094, -127404, -164389, -144795, -71888, -13118, -162006, -162690, -89875, -116727, -110222, -185818, -123517, -42541, -86008, -139712, -134661, -154515, -103289, -102172, -171392, -185431, -169298, -104012, -234112, -150035, -202369, -259435, -134453, -85101, -114549, -161120, -233039, -221196, -174608, -40229, -137368, -125255, -59935, -110008, -148532, -145357, -223666, -63909, -200297, -164079, -90633, -102098, -29215, -259143, -212990, -71017, -164629, -143733, -169841, -187530, -169824, -139614, -186029, -169678, -257474, -89039, -151871, -28719, -219141, -128084, -34883, -143338, -59802, -86542, -204985, -103410, -159192, -91432, -196369, -189607, -207097, -146567, -146376, -177715, -131520]
9960a31520j19844J58133j0368o1782n1747J36831r0892O2639q2039J4551q922
9949a84960j7698K2940J6456L4661r9485J22202p9967q8223J07967K236j1461
9938a75332J01459l5718j06270R2167M4407j41552N1712N6684p3329k1205J4514
9927a92463J9082M8242r2027P1004J5673j4618N525q7747P0039N0851j09156k5724
9915b41319J94400j14359J02828j87308Q5198N5161n8179N3473j07119R9598n4515
9904a72141L0339K454k7848n7907K01512k03271J7069J33420q8901Q8476j76675
9893b53473J72253P139j11627M1464m7348K978P8319j02654L1581N2539n1654
9882a80483l140q4062J25130R3889j89908R4554l1599J8451L5083k8359o6507
$$ y = [-131520, -251364, -93231, -103599, -165381, -217128, -80297, -171189, -108550, -190589, -176038, -184960, -202658, -179718, -163262, -128601, -228086, -105884, -185851, -274074, -166107, -163871, -175332, -73873, -109591, -215861, -123694, -79287, -220839, -169127, -112443, -185772, -206977, -192463, -173381, -125139, -217166, -146162, -130489, -145107, -139582, -227329, -157290, -106439, -215595, -241319, -46919, -161278, -58450, -245758, -160560, -105399, -163578, -110105, -217224, -117626, -172141, -141802, -139348, -167196, -225103, -23591, -226862, -209793, -76373, -165274, -76798, -253473, -81220, -74081, -185708, -144244, -191592, -188614, -110295, -212949, -181368, -128829, -180483, -183623, -267685, -142555, -48666, -238574, -144020, -175619, -157168, -122085, -150444, -216951]
9871b16951J08406M147j29744L6185M2963J10480k38570M7493L0794m4551m8367
9860b97715J26644j7033J3739M4213r2829L7940J1515N9385k0089n3978R0208
9849i8000n7680M3516r7654P4488m2046q851L8318l8104M8552p1611J763r549
9837b16858Q9738r1535J49968j32175P6713J4810p3464Q857o5071J00232q9105
9826b27890P1797J3017M8465j7850J3327j38979J11710j267k979l5125p8370J45330
9814i8814J6328j27551J35453N3985o1321J425r7826R0249k141q476k7587r4553
9802b20829L9624J06240k7392n5053n5434J975J40834q7250l4250P6079O0827
9791e4629p7308N4093k1366J9087j38758N7020M3615N7777N2423r0977p951p6906
$$ y = [-216951, -108545, -104398, -234142, -197957, -154994, -44514, -283084, -235591, -204797, -249348, -297715, -171071, -188104, -174365, -130152, -222981, -185041, -173526, -114141, -134230, -188208, -98000, -155680, -112164, -209818, -135330, -177376, -186227, -147909, -186013, -137461, -209072, -207309, -216858, -127120, -218655, -68687, -200862, -124149, -109339, -182803, -173946, -239017, -138785, -227890, -156093, -143076, -94611, -112461, -99134, -238113, -126403, -127670, -130649, -165774, -244144, -98814, -82486, -210037, -74584, -20599, -81920, -80495, -178321, -88072, -90213, -98689, -126276, -220829, -181205, -74965, -102357, -157410, -212844, -210869, -70035, -157285, -191535, -115456, -54629, -131937, -77844, -99210, -80123, -218881, -161861, -118246, -60469, -8046, -99023, -106974, -183880]
9779a83880J07051j11925q1497J01781o4119J34717j27262O2767j04587K12923
9769e4031j46010l1933k6794R2476j1953r2467R9279o249o8680J1408N7713J33045
9757d4196p0120j2788R965P50J2183m9138N2678q5159m2188N3835P7224P327j9571
9744a09198r5900O8300n6203J22268m5926L3885n158p6114n801P4550n6794P1692
9732h0399p2227M8763J0948p2530K7813J893j13j33597J35480l6184L5595m2440
9720a76998P0993m4870M5552q961Q613k4311J15035q2956j05942J84970j81462
9709b00337J97361j16129p9390J17262j6705j902k9294m8251O3297J48313k07486
9698a73261J91294n0271P5563j44391J0166Q0699O7526j18509r685R0196q7358
$$ y = [-183880, -76829, -188754, -270251, -168470, -232589, -97872, -225134, -162367, -266954, -54031, -200041, -231974, -258768, -166292, -178245, -270712, -171433, -177682, -246362, -234954, -177241, -44196, -114316, -127104, -117139, -116389, -104206, -153344, -100666, -185825, -228013, -174178, -96954, -89627, -109198, -205098, -136798, -193001, -70733, -116659, -82774, -87932, -164046, -169847, -95297, -152091, -80399, -152626, -103863, -92915, -165445, -137632, -135739, -135852, -269449, -133969, -170153, -134558, -176998, -106005, -150875, -105323, -114284, -105671, -129982, -14947, -97903, -203845, -18875, -200337, -2976, -119105, -198495, -81233, -97938, -99840, -129134, -177385, -114088, 34225, -173261, 18033, -32238, 43325, -101066, -90900, -10201, 57325, -61184, -70869, 19327, -68031]
9687f8031O8735m3505m2085L684j3187l455j08495K68423j01921J4340k07432
9676b32929J61537o3488L3623l8506j5567J01530r3583p4326N8169q9674J89728
9665f3486j18855R8001q6573J7287O2892j07156R4510j0076p5630K1056J37408
9654c0622j27651O8074n8761j5019k2942J01626q4796N791n2180J92825j46709
9643a70364r647j5290Q081R7474m3268r8497P0121L9042j16606J44617j46024
9632b40361K7597J51622j53256P8870J03089o3204j7734j29619K52655k21517
9622b11858K3207R2644k7018P7185j54175Q01J35858q2831j2802q9360P9674M3026
9610a25649j32345J09108o2801J52052j20724R1260j30458R8353k5860n1114O6487
$$ y = [-68031, 704, -42801, -84886, -81202, -94389, -97844, -206339, 62084, -39837, -25497, -232929, -71392, -134880, -101257, -139763, -155330, -53800, -147383, -221709, -163540, -253214, -63486, -182341, -84340, -170913, -153626, -90734, -197890, -103380, -113456, -189086, -168030, -30622, -158273, -90199, -148960, -163979, -186921, -85295, -170091, -164300, -216480, -23655, -170364, -180011, -195301, -187220, -89746, -133014, -231511, -161390, -122348, -238954, -94337, -240361, -212764, -61142, -214398, -135528, -32439, -95643, -113377, -242996, 9659, -211858, -188651, -96007, -123025, -45840, -200015, -199214, -63356, -146187, -158989, -248349, -168675, -125649, -257994, -148886, -211687, -59635, -180359, -89099, -219557, -121204, -147064, -198178, -131691]
9599a31691q2097j8432n1578J17467l3015J57350j47352l5270R5615q8063O9755
9588a47311m7183p6966O5109M5534m3859r5602J23945O207K5485j34731J90076
9577h9296q1576j29606J64038k0323N2047n3556M557O7713m277j83707J18791
9566a55195L4512L0704j12249N9445q012j1358k3043O1654j6784J5677J3991m1567
9554a52225n0170N8262j40318J92357R477q1868J3698p7591J77667q7259n7233
9543a95203R0412k4479L3265j45143R5928N2328n4088O3992j22955O5694n7991
9532a98240J9528m9711J16271j09592j934N5167j25072J82964j88557J45837j46001
9521b99340Q0760R9568j59989Q5578j312l9441O6144j36372J39071m7160P9455
$$ y = [-131691, -213788, -232220, -283798, -166331, -199346, -41996, -189348, -224618, -129003, -217066, -147311, -194494, -271460, -206351, -160817, -204676, -300278, -176333, -170126, -144641, -279372, -89296, -170872, -300478, -136440, -156763, -104716, -158272, -153715, -86002, -90279, -273986, -155195, -120683, -89979, -202228, -142783, -150795, -162153, -185196, -123542, -140326, -124649, -110658, -152225, -202395, -144133, -284451, -92094, -82617, -164485, -150787, -228378, -50711, -137970, -195203, -104791, -129270, -96005, -241148, -145220, -92892, -146980, -82988, -205943, -140249, -198240, -178712, -228423, -112152, -221744, -223678, -168511, -293583, -110619, -299176, -153339, -299340, -218580, -119012, -279001, -193423, -194735, -234176, -168032, -304404, -165333, -212493, -133038]
9510a33038r3755j5130K12364j47320L5242L4247O60j14564j4084J33333k0556
9499a22601J99613q4798q2590K4071p0835j3602O3752j3684j59739J75596j30802
9488b15619k7265J65350j40992J15170j58070J2075K7548Q7501n5905L9997Q1050
9477f9160o6152l7953o3209J70725j23865r2480J01346N1869n4196n9747N6325
9466a86497R4883j26314L763N6572N903N4301j47212J2494Q2771k9968l387l0006
9454b12697J4633N6344l7503m7152N6623L0853L06m4386R81M9434q7193J25925
9442i3832o5900k8168N7291k7651M5795q4880l7772J52177n7836N6101r7123J68784
9430a3014k43298J30802q1993R2557K5429p9310L1095m7115P1364p102K8629K524
$$ y = [-133038, -226793, -241923, -29559, -176879, -141637, -107390, -106730, -221294, -235378, -102045, -122601, 77012, -7786, -90376, -66305, -137140, -150742, -86990, -100674, -260413, -84817, -215619, -242884, -77534, -218526, -103356, -261426, -249351, -221803, -134302, -190207, -150210, -69160, -135312, -173265, -236474, -65749, -189614, -282094, -180748, -128879, -183075, -242822, -186497, -91614, -217928, -214165, -157593, -151690, -97389, -244601, -232107, -149336, -179304, -182691, -212697, -198064, -141720, -179223, -226375, -169752, -138899, -138593, -182979, -181998, -132564, -219757, -93832, -159732, -187900, -130609, -158260, -112465, -197345, -235117, -82940, -140776, -84675, -181798, -13014, -256312, -125510, -207503, -114946, -89517, -168827, -137732, -184847, -113483, -120585, -91956, -89432]
9418h9432j6792O655j6164M2818o4136K2227N222M0157k9266j09606Q5396L1102
9406i1819l5018k7163m9795N6272M3070m4128O2491J30803r0242n8893m5841P2568
9394g7695l1297n3245l9788J19866j04552M7538R433N2413P255o0293M7373j64660
9382b47652J62392r7007Q0034j05667Q868M7277Q361k8282j8188M9784k0079R6615
9370f3544k5831k8387o0194k0214J18146q3200j6925k5586N8238P0115o3059j21028
9358b61469L4380P5707m3872J00967N655p7193J4556j20024K63929j57559N0471
9347a14452j14295r522O6127O8316l4076j7244m0306R2792n5134k0690O9911M2118
9335f6455j15782k6675J34855r4397L8850N596k3450j7163N9277n9356N3314p0556
$$ y = [-89432, -106224, -99569, -115733, -72915, -137051, -114824, -109602, -69445, -98711, -208317, -122921, -91819, -126837, -154000, -203795, -147523, -104453, -148581, -86090, 44713, -45529, -104422, -150263, -77695, -108992, -162237, -202025, -82159, -186711, -139173, -129740, -77327, -70072, -130365, -82992, -247652, -85260, -182267, -102233, -207900, -199032, -151755, -143394, -171676, -189864, -140080, -160159, -63544, -89375, -117762, -177956, -198170, -80024, -163224, -180149, -205735, -147497, -77382, -140441, -261469, -227089, -151382, -195254, -94287, -88632, -165825, -151269, -271293, -7364, -164923, -114452, -228747, -238269, -172142, -103826, -137902, -155146, -195452, -102660, -157794, -178484, -108573, -66455, -182237, -208912, -74057, -168454, -129604, -124008, -147458, -164621, -105344, -164700, -111386, -181942]
9323a81942L610K5002M3123m6808L5332o028J6820j80161J90862J6176p005M9255
9311d1764j16459R7544j994j20710J732J08021o9989K7254P6566r5076N0188n487
9299i0174L4296j0074p3675j37117K01303m2180J6370j0928m9260J06509j17520
9288a72450J40013j46065N1024P1150o4314O78k0576N6272J10335j20909j2576
9277a07418K4422M391n6753J8692j5858M7446j91629L0198J75880M420j39731
9266b05940o2513J51625p2368L4027o461M5574O4395q220q5627J02018l7832K8777
9254e2545m0996k4243p515J44571p8762j08925j0419J58456o6475j02729J75562
9243a4020j18420J1776j01350Q0750J24865j10746N4312j08269j8692J77535j8201
$$ y = [-181942, -178332, -153330, -110207, -157015, -121683, -127711, -110891, -291052, -100190, -84014, -91019, -41764, -158223, -60679, -62673, -183383, -181651, -73630, -143619, -116365, -39799, -134875, -84687, -90174, -55878, -65952, -139627, -276744, -75441, -117621, -101251, -112179, -161439, -54930, -172450, -32437, -178502, -127478, -56328, -120642, -119964, -140540, -84268, 26067, -94842, -107418, -82996, -78605, -135358, -116666, -132524, -85078, -276707, -246509, -70629, -66209, -205940, -268453, -116828, -189196, -155169, -161630, -116056, -51661, -59881, -145508, -43490, -81322, -52545, -93541, -117784, -125299, 19272, -59490, -168415, -178834, -20378, -86853, -189582, -14020, -132440, -120664, -222014, -141264, -16399, -127145, -72833, -181102, -199794, -22259, -40460]
9232d0460l6782j04895J33013L0850q3368J1332M011P5687j12272O507j902j9242
9220a37521R553P8995M5595m073j59596M1717R1820r425j08225J53309o7725q9712
9208a55288P2396p5027L3669j2767J20285o8250l5210M1492O7608K2936j76700
9197a64856J31123k2050M2319r5393l5771J55634j92432O9644M7776j0975L5499
9186c9482k2433q108J03379n4530p3900j07053J20090J21472L9977p3564p5788
9175f9940J14590L9752r5114j5050J09073j01861R86K0248J03522j19523p3322
9164h6639Q0693k5949J19745j37313J46995N4265j42704J02092m4436m233O4654
9153A27170j09417J75722p8754N9853k7669k0530K9613n9750O6701l3043L3047
$$ y = [-40460, -77242, -182137, -49124, -18274, -101642, -90310, -86299, -10612, -122884, -116377, -118279, -137521, -127968, -48973, -3378, -7451, -167047, -125330, -33510, -42935, -151160, 2149, -65576, -155288, -82892, -157919, -124250, -137017, -16732, -84982, -120192, -78700, -11092, 11844, -164856, -33733, -55783, -13464, -108857, -144628, 11006, -181426, -111782, -64006, -74981, -39482, -61915, -70023, 33356, -21174, -95074, -202127, -82037, 39435, 79412, 5848, -69940, 44650, 84402, -10712, -25762, 83311, -18550, -17564, 2684, 106206, -13317, -86639, -5946, -31895, 87850, -49463, 97532, 151797, 9093, 111185, 66749, 62516, 127170, 17753, 193475, 114721, 174574, 146905, 126375, 155988, 96238, 162939, 129896, 162943]
9142A62943L2023N7189q038K9019j11044J7187R2180j11084M7784J03462j9478
9131B92143l6247P3745j1882p6359K9564J68213l4198L7703m6058J67533k4483
9120E39674J10007m4934N4095k5328J95332Q721q7245O4232j4726N7670J34870
9109I92368J11777p8185J22169M318L1681L6338J61874K5981J0563J35666M0653
9098A595203J94308L4756J40662P9296L09793M98094M05585O97388J032433J905618
9088F893136M523865J3879569K5393705k5421595j2463559m898877k641635j439452
9080C825157j083118m13204l29646k22624l17875n1818l23109j60852M4387K436
9070I69734j05094j81327N3166O684o4118n3817L7342j30825j50967L4495m8994
$$ y = [162943, 194966, 252155, 244117, 273136, 162092, 179279, 271459, 160375, 208159, 311621, 292143, 255896, 329641, 317759, 241400, 270964, 439177, 404979, 442682, 396624, 564157, 539674, 649681, 604747, 658842, 633514, 828846, 837567, 750322, 814554, 799828, 857498, 992368, 1104145, 1025960, 1148129, 1152447, 1184128, 1220466, 1382340, 1408321, 1418884, 1554550, 1595203, 1789511, 1824267, 1964929, 2044225, 2354018, 2852112, 3257697, 3955085, 4987518, 6893136, 11417001, 25296570, 50690275, 25268680, 12805121, 7906244, 5264609, 3825157, 2742039, 2328835, 1999189, 1776565, 1458690, 1406872, 1083763, 922911, 967298, 969734, 864640, 683313, 736479, 743163, 679045, 625228, 662570, 531745, 380778, 415273, 366279]
9059C66279K03419j15809j00370K34126k38602P0668p549j90428J77863j7172
9049C82425q0331j46685m0873M2795p56Q0980r4515q0373R804O2750m8369r168
9037G7684P5246O0359n9355J0631J5990P5084j52625M1535N2311o618j14599j30543
9025e4900J03190l4298J25064j12908j7202Q4680M3517j14089p2853N9358J1805
9014B1364J36497j73656Q0021j7497k7320O8901n6958Q0655k2127j02410n8293
9003g0823P4961O3411J6457n0553n566J08153j13390M124n6726O1628n5273j07485
8991a31082J06993J6427K4280M2109l4828q2300j0077M2777J38921j85315Q4785
8980A2690k7566l6734Q0389j77314J87254q4781J15469j58621K4803L3506l6846
$$ y = [366279, 569698, 453889, 353519, 587645, 349043, 419711, 412162, 221734, 399597, 382425, 302094, 155409, 114536, 157331, 156575, 237555, 143040, 62667, 72471, 135221, 86852, 77684, 152930, 213289, 153934, 164565, 180555, 255639, 103014, 144549, 196860, 190242, 75643, -54900, 48290, 13992, 139056, 26148, 8946, 93626, 137143, 23054, -49799, 9559, 21364, 157861, -15795, 64226, 46729, 19409, 88310, 31352, 112007, 89880, -12530, -70823, 4138, 67549, 84006, 33453, 27887, 136040, 22650, 26774, -29952, 31676, -23597, -131082, -24089, -7662, 16618, 58727, 23899, -58401, -68478, -25701, 113220, -72095, 12690, -14876, -51610, 28779, -148535, 38719, -46062, 69407, -89214, -64411, -30905, -67751]
8969f7751L9783n3190K9873K6210j16949q5290J96053j0810j18802P0603p2644
8958a62914M1270k6389k436K2592l5008j152L7410p0367M6384L8908j4226l328
8946a29256n3054M822N9995J4966K7542J1721p1530n6028p83N3424M995j3466
8934a46652K5202r6159J62739K3829j22323n3378J04854o8905l0036J09897j08483
8923a99415J75402j69204M7901m0587N0102n4495k5418M9946K8498k5338n6922
8912b19530R5881j0627o4566N7713L5873O4330o7641K3968l9923m5524M2369l099
8900a30776p5803j57695K11053l2403J46596m9239j35155L3553p0606J23163l1045
8889a68357K9701J3225p5551Q835n5387R757J8003J07642n6272P2212o7703l5658
$$ y = [-67751, -27968, -81158, -51285, -25075, -142024, -227314, -31261, -42071, -160873, -90270, -162914, -121644, -148033, -150469, -127877, -162885, -164037, -126627, -196994, -150610, -111702, -125928, -129256, -182310, -177488, -117493, -102527, -74985, -63264, -134794, -190822, -191605, -138181, -133186, -146652, -121450, -217609, -54870, -31041, -153364, -206742, -101888, -170793, -200829, -90932, -199415, -24013, -193217, -145316, -185903, -135801, -190296, -215714, -165768, -137270, -162608, -219530, -123649, -134276, -198842, -141129, -105256, -40926, -108567, -84599, -124522, -170046, -127677, -130776, -206579, -364274, -153221, -185624, -39028, -88267, -223422, -189869, -260475, -137312, -168357, -138656, -125431, -200982, -192147, -247534, -237777, -219774, -112132, -168404, -96192, -163895, -199553]
8877a99553L7570o459N2307n3445R8175o7806r0108K23109j72496R3355m9307
8866a34658O0939k8261M5874q1916R2758j01407q722J04613m1034q2314M7508
8855a26620n7135J3388Q7127j00348q9322L2841J62035o5688q4338J18008o4034
8844a74086N7123j86129M1917J64638j1345r1049j9898P3740q475j3566L1499
8833a35631R752M0227k9862n7162L6454m3388K0679j05102P9823P6685j11743
8822b19268R8557m1185l8848M4134k05276J29743K9864k4728K4333J10719j07695
8811a99650K2090k1711Q2650n8411N0428j03167o3480J55248k15160J60378O0703
8800a30082o0489o7857M4062J7062N3352q1903J805N421K9132o4208O9101j3159
$$ y = [-199553, -161983, -168442, -116135, -169580, -71405, -139211, -229319, -6210, -178706, -85351, -134658, -73719, -101980, -56106, -138022, -45264, -146671, -155393, -50780, -91814, -174128, -126620, -183755, -170367, -83240, -183588, -272910, -240069, -78034, -143722, -228060, -110052, -174086, -116963, -303092, -261175, -96537, -107882, -198931, -218829, -145089, -153564, -167130, -135631, -125879, -85652, -115514, -172676, -136222, -179610, -158931, -264033, -184210, -107525, -219268, -120711, -161896, -200744, -156610, -361886, -232143, -202279, -227007, -202674, -91955, -199650, -177560, -199271, -116621, -175032, -124604, -227771, -291251, -136003, -351163, -190785, -130082, -190571, -258428, -214366, -197304, -143952, -225855, -224050, -218629, -189497, -253705, -184604, -197763]
8788a97763J1145o5165j73067K77813o7801P3735o3924o7193R1002l7879o2495
8777b81592M4898q6066J16197j64524J43758R5019j8522r2045N0509K8798n0199
8766b13769l4542J12288p1144K9617Q4996j28665J27124r3100k8058k6071J540
8755b39784L2189k1208n6179R7368L2836O5547q5605J4561p1039J0372k0897N8524
8743a83315m0058P0240j33209P2747j04079N2278N3725L6456r4280J16779m8331
8732b01047j32282J49302j03647P3108q9019k317J1922J13774J6926p0861j00474
8721c34615J20493r172o2194J10473o6554K0446k1213K8103j185O862n2060o0190
8709c20806J08156j1929k3519q0981J36426J6945l2561p0526K9678J5543J4435
$$ y = [-197763, -186618, -251783, -424850, -147037, -214838, -141103, -205027, -272220, -181218, -219097, -281592, -236694, -322760, -206563, -371087, -227329, -132310, -150832, -242877, -192368, -163570, -213769, -248311, -136023, -207167, -177550, -92554, -221219, -94095, -187195, -215253, -241324, -239784, -207595, -228803, -284982, -187614, -154778, -89231, -174836, -160275, -231314, -220942, -241839, -183315, -223373, -153133, -286342, -213595, -317674, -265396, -211671, -175215, -269495, -152716, -201047, -333329, -184027, -287674, -214566, -303585, -305902, -293980, -180206, -163280, -234141, -334615, -214122, -223294, -285488, -175015, -241569, -221123, -242336, -214233, -215418, -208556, -260616, -320806, -212650, -224579, -248098, -329079, -192653, -175708, -208269, -278795, -249117, -233574, -219139]
8698b19139m013j22178K67754j80889J34642m7809M3562l051j54469J37240l5172
8687a83522L478k8417O6523j3775p8449Q4500n7643R5169r3368m7692M1370O7014
8675a44812j10136J30564m1988j7170L2936J48242J2723j33488K5184p9964j03140
8664b81049P0828J632p893K8749l2437j9528K2507J6439m4614N050J11181k02823
8652c31958J11447N4020r5058L218m2402P6759q4094O8408M6556K560n0397o2541
8640c03482O0027j994m5747J124J67001j61992p023O6825k5170L4296j5064Q767
8628b22432k3897L9302j25557P7860J4814N5970m2335k7316P2346j13015K8636
8617b65624M6221L2136M4635j44824N6091K7670J0503J9420k7586K3518m4035
$$ y = [-219139, -223152, -345330, -77576, -258465, -123823, -171632, -128070, -131121, -285590, -148350, -183522, -180044, -208461, -141938, -155713, -234162, -149662, -207305, -112136, -205504, -253196, -211826, -144812, -254948, -124384, -166372, -183542, -150606, -2364, 10359, -123129, -97945, -177909, -281049, -210221, -208589, -216482, -187733, -220170, -239698, -217191, -200752, -245366, -240316, -129135, -331958, -220511, -166491, -261549, -258331, -300733, -223974, -308068, -239660, -193104, -190544, -240941, -303482, -243455, -245449, -291196, -290072, -123071, -285063, -292086, -225261, -250431, -216135, -231199, -222432, -246329, -207027, -332584, -254724, -239910, -183940, -226275, -253591, -181245, -294260, -265624, -219403, -187267, -142632, -287456, -231365, -203695, -193192, -173772, -201358, -177840, -221875]
8606b21875j8106j5873J5222R4499o4762m0997N7645L3039o9907p235j8067L7502
8594b18915L1702L5464m6006L2628J998j11304L0553j2716R7420k5355j0034j9917
8582b14482n7625j061p2203L4519R967j6426M6887j6562L4970k9090P6111l4319
8570b39314O1886j37260K6435J5900Q5442r1632K8314N6171m9404L6535k0130
8559b27057M4621j03277r0455J13056k1568n645J0527Q8722p6149J1401m4150
8548b99974P7488n275J00943k35484J67036q0882O4395J1689j37598R0383j4984
8537b62263J26813k26726P3475m9366j47649M53728q5430q272n3152p1931r2516
8526c43289J52348M3423j01407n6769R7070l1540o0538J67486j59794J44044j42938
$$ y = [-221875, -239981, -255854, -240632, -146133, -210895, -251892, -194247, -161208, -231115, -238350, -256417, -218915, -187213, -151749, -197755, -165127, -163129, -274433, -243880, -256596, -159176, -184531, -194565, -214482, -272107, -273168, -345371, -310852, -300885, -317311, -270424, -286986, -252016, -281106, -204995, -239314, -177428, -314688, -288253, -272353, -186911, -278543, -250229, -194058, -243462, -206927, -227057, -182436, -285713, -376168, -263112, -284680, -290325, -279798, -191076, -267225, -255824, -299974, -222486, -227761, -126818, -362302, -195266, -276148, -211753, -200064, -337662, -247279, -262263, -135450, -362176, -288701, -338067, -485716, -31988, -117418, -125690, -178842, -250773, -343289, -190941, -147518, -248925, -305694, -208624, -240164, -300702, -133216, -293010, -148966, -291904]
8515b91904O8426J7105r3945J49486j19156P2637l368J7241J9027l3195J3216
8504a84430J5900o7553O5520P940j20989O2124p303k7532J2784J15195o3180l4921
8492b26445K8987n2951J23960k02242O1093n0300R3786N7419j27564J16770m3104
8481b20591N4770j75540L7268Q7546j9376l4994j9175Q6765j12167J32235q8368
8470b71627P3431j4246m68J9987j75372J06127k8110k894K6402n588L0362p2328
8458c14324P9721L8642j17574P3057O6175n5097j3283j19763J78523r5025J3825
8447b65123J66481j75186K9661J04519j03903N4065O8663j09896N0745O6258j03224
8436b16940L1317j56967J29433m1813J7155Q7372j37259J22294j03534P1262L606
$$ y = [-291904, -223478, -206373, -300318, -150832, -269988, -197351, -200719, -183478, -164451, -197646, -184430, -168530, -236083, -170563, -162623, -283612, -221488, -228791, -256323, -243539, -128344, -191524, -226445, -197458, -250409, -126449, -328691, -267598, -317898, -224112, -166693, -294257, -177487, -220591, -165821, -341361, -304093, -216547, -235923, -270917, -290092, -203327, -315494, -183259, -271627, -198196, -212442, -212910, -192923, -368295, -262168, -290278, -293172, -266770, -272358, -241996, -314324, -234603, -195961, -313535, -240478, -174303, -229400, -242683, -362446, -183923, -278948, -265123, -98642, -273828, -244167, -139648, -243551, -189486, -120823, -230719, -179974, -113716, -216940, -185623, -342590, -213157, -254970, -237815, -150443, -287702, -165408, -268942, -197680, -194074]
8425a94074K9603j51086O4744j01940J44403m242j8463Q130l4313J12577q9024
8414b33685m6680J00030j41733Q1544p8182J31381j27719J5206n1386J42995m2762
8403b50991o5459J09637j39469J11541j26140R4680o8921m4048M1470P747Q3533
8392b46420j09867J09454l1431O7393o2527j2161O8612k9974k1674l3668J05696
8381a96567j42103O1852L8840l822J25011j03979m0794O4729L4696J3752j02861
8370b51246o1637K15955k64530J83370j95910K84680j35526l6311j19144O3290
8360c17009J4131k1113J88844k0768J7288j34705M1442o4991J4049O2538n0871
8349b71165J7216l5041J80404j15177M3178m7907J1047o1927J00496Q916j13152
$$ y = [-194074, -164471, -315557, -250813, -352753, -208350, -212592, -231055, -222925, -257238, -144661, -233685, -280365, -180335, -322068, -240524, -318706, -187325, -315044, -299838, -351224, -208229, -250991, -316450, -206813, -346282, -234741, -360881, -266201, -335122, -379170, -337700, -329953, -246420, -356287, -246833, -278264, -210871, -273398, -285559, -216947, -246921, -268595, -302263, -196567, -338670, -276818, -237978, -241800, -116789, -220768, -261562, -196833, -162137, -148385, -251246, -312883, -96928, -361458, -178088, -373998, -89318, -224844, -261155, -380299, -317009, -302878, -323991, -135147, -155915, -138627, -273332, -231890, -296881, -282832, -220294, -271165, -253949, -288990, -108586, -223763, -180585, -228492, -217445, -279372, -178876, -169960, -283112]
8338b83112n1846K03510n5682r6255p7661M2740K59067j29578K1413o4070P9705
8327a51769p9545j04733J72343o1419q4011L61p916R9237p5378R9400l1120m2535
8315b67085O5645K6572k6128j2275r5277Q4521j01715Q6163N23M1332N3597q1928
8303b26055J735n3707J2K6843k4065N7247J01454j43819P7984j20842Q4654q4390
8291c02949M7213l3795Q0692p8089O0009k7804R0764p5071j0815Q1544p2546L8066
8279b02781q5814p7380R9929O9762l2485q652j3523k8375J13335p3062o8668J23895
8267a83819j13816J3246J9793J04368r0503m9292M8319K4708j0354M2222o3415
8256b58543J3518j0107k0035J02944j60913J01245M5359p3133R9854j51391M5551
$$ y = [-283112, -334958, -131448, -187130, -283385, -361046, -318306, -59239, -188817, -167404, -231474, -151769, -231314, -336047, -163704, -225123, -309134, -308773, -316689, -217452, -292830, -193430, -224550, -267085, -201440, -174868, -200996, -213271, -308548, -224027, -325742, -239579, -239056, -197724, -144127, -226055, -224320, -278027, -278015, -251172, -275237, -217990, -116536, -260355, -182371, -303213, -218559, -302949, -255736, -289531, -208839, -286928, -226919, -254723, -163959, -239030, -249845, -168301, -240847, -202781, -288595, -365975, -266046, -196284, -228769, -237421, -250944, -279319, -165984, -239046, -307714, -183819, -297635, -284389, -264596, -160228, -250731, -300023, -251704, -226996, -237350, -195128, -258543, -245025, -255132, -275167, -172223, -333136, -231891, -186532, -259665, -159811, -311202, -265651]
8245b65651k8231p7729K72157k26996k0967K29R6480N76J5656m4842K2970Q636
8233b47712O4508j07990J04158r7207R2056R5842j39860R9484j51624M7443K8166
8222b12736r633K288p0819O411K3608P7136M7782j52366k4088O1057M6323l9189
8210b44226K8639O1472J8498j33130o6778P6698P0542k11145J40411J67016p7115
8199a69118j43271p8239K2728K30733o9307Q1125j16572j95607J35644J63712
8189a38172p2875N7780L2073k12193J08708M4065j31286K0502L8965o153j20207
8178c78793M4252K3536K8630M7590Q418j26406J45425J2048r1242J03461j20117
8167c03198p700Q9092O031j2621j04899N8392k7687L9967m7009N9203p8228N4029
$$ y = [-265651, -293882, -371611, -99454, -326450, -347417, -347188, -250708, -250132, -234476, -279318, -256348, -247712, -183204, -291194, -187036, -284243, -192187, -96345, -236205, -136721, -288345, -240902, -212736, -222369, -220081, -290900, -284489, -260881, -183745, -135963, -288329, -312417, -251360, -205037, -244226, -215587, -154115, -135617, -268747, -335525, -258827, -188285, -399430, -259019, -92003, -169118, -312389, -390628, -367900, -137167, -206474, -125349, -241921, -437528, -301884, -138172, -211047, -153267, -121194, -333387, -224679, -180614, -311900, -291398, -252433, -258586, -378793, -334541, -311005, -282375, -234785, -226367, -352773, -207348, -195300, -286542, -183081, -303198, -310898, -221806, -215775, -228396, -333295, -274903, -302590, -262623, -309632, -250429, -328657, -274628]
8155b74628N5813J0108j1727R926k5155L1663k3218J49600j40534L6695Q763p0347
8143b43041P930k1667j1386J59051j48788l9105Q651L2121J1403q3749J09260
8132b19320Q2730j22564J06043r2533m882n118m6707J18058o7147o178O7198j02142
8120b92562K12753j05306M3814j71029Q7337P8282j45107K500n5664J81532j00244
8109b63694j7955q9598K22576p9843j12380J02866P6779m5417j9510J09984r9323
8098b15515Q8469j56061P7139Q1959k9856q7313m9042J56832n9364m1444J7652
8087b16544p264n5694J11759j05792J10707o2315l1528J30588r6036J02476j48389
8076b68032L5942M8996m2749k3583p624R2679o0767N642L306O3685l0985j19706
$$ y = [-274628, -218815, -208707, -220434, -210508, -235663, -204000, -227218, -77618, -218152, -181457, -172694, -243041, -235111, -256778, -268164, -109113, -257901, -297006, -288355, -256234, -244831, -328580, -219320, -136590, -259154, -153111, -245644, -250526, -255644, -302351, -184293, -251440, -257618, -190420, -292562, -79809, -185115, -141301, -312330, -224993, -146711, -291818, -289318, -344982, -163450, -263694, -281649, -371247, -148671, -228514, -340894, -238028, -161249, -206666, -226176, -116192, -215515, -127046, -283107, -205968, -124009, -153865, -241178, -290220, -133388, -192752, -234196, -216544, -223808, -279502, -167743, -273535, -162828, -225143, -256671, -126083, -222119, -119643, -268032, -232090, -183094, -225843, -249426, -257050, -164371, -225138, -219496, -216190, -152505, -183490, -303196]
8064c03196k7368J22424j04788L6761R0775o3481N4013j32873O3310K1174Q935
8053b34314k8632l8939N0955M4612O9151j14294K5682j3946l1842J4509m4796
8042c01854J31018n7078k5964m1570J27703j30570k8346J03611J05068j07445
8032b25427o4813J12006j8881N298K0571q0791L1126n4295m457O9978k6049q402
8020b44136j01100N1738J23458o9698N9645p1396n3898O1400K0587l8185M2842
8009b18743k7665J6861l0780j4121K1429M989n2664K6083M6255K4504J0039j5799
7997b09612j0241M0152q2161J01460j26135P7706q805k7983m4267J18210L2298
7986a39378m2207j03306K6584J1533K8578L3522j26595J67121j89182K15769q2396
$$ y = [-303196, -330564, -208140, -312928, -276167, -185392, -248873, -194860, -327733, -264423, -243249, -234314, -262946, -301885, -250930, -206318, -137167, -251461, -225779, -239725, -271567, -257058, -301854, -170836, -227914, -253878, -295448, -167745, -298315, -326661, -223050, -117982, -225427, -290240, -178234, -197115, -191817, -171246, -252037, -220911, -275206, -279663, -209685, -235734, -244136, -345236, -293498, -170040, -239738, -180093, -251489, -305387, -243987, -223400, -261585, -218743, -246408, -229547, -260327, -274448, -253019, -248030, -300694, -274611, -228356, -203852, -193813, -209612, -219853, -179701, -261862, -160402, -286537, -208831, -217636, -245619, -289886, -171676, -139378, -181585, -284891, -258307, -246774, -218196, -184674, -311269, -144148, -333330, -117561, -199957]
7975a99957p0333P1336K061o517q9099j6064Q9395k1334j9147q7521J05172J17736
7963a24272k14137o7069K36851P2616j25253j20356J95539m4464q9892J05556
7953a74881o5258Q3114o8748o7461K3730Q3390N3122j23450k542m58j5323L3394
7941b41371K8396o292J9286p2556O4607n5515L1598J09514j32338K1795N588J21290
7929a05998j61215M5854J4684K9900q8541p1777K03875m6053j0526j05491Q5669
7918b09619q721J6310q5808P4435M0811j11972J1988M6535J19971j23573k1787
7907b51430P9589M8686j41007P7113m2557K2908o5855K3485M3853P648n017l1494
7895b34078j9185J17694r3675J37399j66847O6592j17301L4903J29191L0459j00866
$$ y = [-199957, -270290, -198954, -196893, -203410, -292509, -308573, -219178, -240512, -259659, -347180, -242008, -124272, -338409, -405478, -168627, -96011, -221264, -341620, -146081, -190545, -280437, -174881, -240139, -157025, -225773, -293234, -269504, -186114, -132992, -256442, -258984, -259442, -274765, -241371, -212975, -219267, -199981, -272537, -207930, -263445, -231847, -122333, -254671, -232876, -227288, -105998, -267213, -221359, -206675, -176775, -265316, -337093, -133218, -179271, -189797, -295288, -209619, -218340, -202030, -287838, -213403, -172592, -284564, -272576, -226041, -106070, -229643, -251430, -171841, -123155, -264162, -187049, -229606, -206698, -272553, -249068, -205215, -197567, -202584, -234078, -253263, -135569, -229244, -91845, -258692, -192100, -309401, -274498, -145307, -114848, -215714]
7884b15714q8956J5119Q7656l1861j27590J28057j1482R1979j70648O2026L7154
7873b24260R0929p9304o093o2092L7921Q2671j47806J50050o5268N1687o1486
7862b33051j3406Q5063p8757Q984j01724K52420k27235J84251k02328Q4120P3399
7851a68264O86766p16747n3593L0097o9137l3281J25063l2200r2300J31203M1856
7840a50537j06011r3422P0378K6807k6040O5539o1717M0758p8439J22039P299
7829a83346m483j32798J28541L9331j19549R4923j13966J27238q1107p592M0277
7818b12531o1106O8167p5878j9848J8213J13057q9431O028J4766Q4034j63334
7807c17863l080J05740J4692k3364o203j04687K10243r3844L9680n1822M9827
$$ y = [-215714, -304670, -289551, -201895, -233756, -361346, -233289, -244771, -152792, -323440, -261414, -224260, -133331, -212635, -218728, -280820, -242899, -160228, -308034, -157984, -223252, -171565, -233051, -246457, -161394, -240151, -231167, -332891, -80471, -307706, -123455, -325783, -241663, -168264, 518502, -198245, -251838, -221741, -290878, -324159, -199096, -231296, -323596, -192393, -150537, -256548, -349970, -279592, -252785, -278825, -213286, -275003, -234245, -312684, -190645, -183346, -187829, -320627, -192086, -152755, -272304, -177381, -291347, -164109, -245216, -252808, -212531, -273637, -205470, -281348, -301196, -282983, -169926, -259357, -253329, -238563, -154529, -317863, -320943, -215203, -200511, -223875, -230078, -334765, -124522, -218366, -178686, -230508, -180681]
7796a80681l2104l3385K9681n7683M0967j15013P6900J4336j979N2215l2234m1714
7784b80694n712Q4358q362j43252K09827j10615Q3041r6361J1440O6437k3831
7773b13724N8008l250j01363J02348K196j1009o1519k8318L7635L3628k0671r9817
7761c05856L1013J47300j49446Q7978o667n3172J0118l5139J18160l618J7051
7750a42278q9994N0706J6342j5510p1847J47300n5583q567q7070J04082Q227q1975
7738b26167P3228j4459q0587R3454j92845J98191j10210Q6292m3567N130p8635
7727b90175J34137o2567J6108l5182P244N8286J4720k4019K3932M1939q4993J8487
7715a82083P2231j20090N0495l1737O953o0078R6142K1087K2263m003j05707N6424
$$ y = [-180681, -212785, -246170, -216489, -274172, -233205, -348218, -271318, -256982, -258961, -206746, -238980, -280694, -286406, -202048, -210410, -353662, -143835, -254450, -171409, -267770, -256330, -189893, -213724, -155716, -158966, -260329, -157981, -155785, -166794, -228313, -256631, -218996, -185368, -206039, -305856, -274843, -127543, -276989, -189011, -195678, -248850, -238732, -273871, -155711, -159329, -142278, -232272, -181566, -165224, -180734, -252581, -105281, -160864, -169431, -256501, -152419, -144192, -226167, -152939, -167398, -247985, -154531, -347376, -149185, -259395, -173103, -216670, -211540, -290175, -156038, -218605, -202497, -237679, -230435, -172149, -157429, -181448, -157516, -115577, -200570, -182083, -109852, -229942, -179447, -211184, -204231, -264309, -168167, -147080, -124817, -128820, -234527, -178103]
7703a78103Q298r695q592L2047k4838n8116j55727J44764J17937n0953m1587m3479
7691b68044J50119o0574p6505N3745P2383j29741J4079o4627K05476j08408J5139
7680a96958K005J1664J05579j13968q15N1664j2783r4565L4098O274M8425m9563
7668b08943q4386J21874o4586M8888J9315n7561J5450N3540j59620O9889j9932
7657b66072L3490M1175j22400J24461k1588J08796j70487K7307L4455m150j1272
7646b26285N2971k8063q4751J39004j16927K9538M2718j3743m8238Q7543P118
7635a59115p5404R0443o5704L7727M7451j07178Q7311r3358L104N3171m5225M130
7623b22647Q6638L136M1459o1303j7162K0433O3493j22796K9179L1953P9015n6306
$$ y = [-178103, -169805, -179500, -188092, -156045, -180883, -238999, -394726, -249962, -132025, -182978, -224565, -268044, -117925, -178499, -255004, -201259, -128876, -258617, -244538, -309165, -103689, -212097, -196958, -194953, -183289, -77710, -191678, -192493, -140829, -153612, -248177, -214079, -207805, -159380, -208943, -293329, -171455, -236041, -187153, -167838, -225399, -209949, -156409, -316029, -246140, -266072, -232582, -191407, -313807, -189346, -210934, -102138, -272625, -245318, -210863, -215013, -226285, -173314, -201377, -286128, -147124, -264051, -234513, -191795, -205538, -253776, -166233, -159115, -234519, -144076, -209780, -172053, -124602, -231780, -144469, -237827, -234723, -181552, -226777, -222647, -136009, -132873, -91414, -152717, -169879, -149446, -85953, -208749, -179570, -147617, -68602, -124908]
7611a24908j16508P7240j2574O5934l6069K6368q6676n3169J17132r4944J09794
7600a28380j00800o1112K60873k47068J11211p5687O0304n4673J24752r3358k4272
7589b28210N811L7054J14235k11540J52051j60916J14134m9016m5906M7522K7391
7578a97390J10838j39602P3475J03848k2967j43460N7323M9761m3195j41665J96747
7567i6287M9396j57611L75M9028K2101K9727l6788m6634J14926j3091k4733j05462
7555b15053R3272p4942m0181J65625r345q7761N9866K0451M9006j25638K5570
7544a39130K0774M5138J14593j66811N9256K3388o410L1955q6731P4945j10435
7533a39468N815Q2657k544L8467j10647K3429L3544o3961J75597k56926J94057
$$ y = [-124908, -241416, -164176, -176750, -110816, -146885, -120517, -207193, -260362, -143230, -238174, -128380, -229180, -290292, -29419, -276487, -165276, -240963, -180659, -235332, -110580, -203938, -228210, -222399, -185345, -71110, -282650, -130599, -291515, -177381, -226397, -272303, -224781, -197390, -86552, -226154, -152679, -48831, -71798, -215258, -157935, -108174, -151369, -293034, -96287, -46891, -204502, -204127, -155099, -132998, -103271, -140059, -186693, -71767, -84858, -109591, -215053, -121781, -196723, -236904, -71279, -80624, -168385, -108519, -88068, -39062, -164700, -139130, -118356, -73218, 41375, -125436, -66180, -42792, -49202, -17247, -103978, -29033, -139468, -133653, -50996, -53540, -15073, -125720, -102291, -68747, -132708, 42889, -214037, -19980]
7522a9980q2315R1150j30989M975N969o254K0580J3000N7522r0398J3980j18590
7510b41350J06464N8531j38935J95221p8455n6460L7991Q225k6258L4767l264
7499a03523q7258N2737P0227q238m2064k3074o1300O2444L7009n4530J13566p5326
7487a19330j57925J47891n1274J0882p790o787P9408m0853N5885j24500J45062
7476f9331q3028m1932O6385M100J4322o9209Q7723K2755o5829R5874j04562M1735
7464a00997l6276J2786L5124q8684J19596j33064J20675j10803J04882m774k7845
7453a09380j5691n3603R9910m3213j4113j11802L4818J12748N620k5925n3711
7442a74342R6201o9617Q5564q7052O0695j12044R8836r6667K9956R6267k1964
$$ y = [-19980, -102295, -11145, -142134, -137159, -131190, -137444, -116864, -103864, -46342, -136740, -122760, -241350, -134886, -76355, -215290, -20069, -98524, -154984, -116993, -108768, -135026, -100259, -103523, -190781, -138044, -67817, -76055, -118119, -141193, -202493, -140049, -103040, -157570, -44004, -119330, -277255, -129364, -180638, -169756, -177546, -184333, -104925, -145778, -89893, -214393, -69331, -152359, -194291, -127906, -123806, -109484, -178693, -90970, -68215, -134044, -38170, -142732, -100997, -137273, -124487, -89363, -178047, -58451, -191515, -70840, -181643, -76761, -81535, -109380, -125071, -178674, -78764, -121977, -136090, -247892, -213074, -100326, -94706, -120631, -174342, -78141, -147758, -62194, -149246, -88551, -200595, -101759, -198426, -168470, -72203, -94167]
7431i4167j18581J6471J04367j18302j8816J648R0747l3907J9735l6956O8309
7420a19452M1699l2894m331J4800K0459o601o6496J05005l4861M2004n1742j4810
7408a07220m4447K7351L3144k1255J25096j01244J72096j22961J20900l3296L5852
7397H4016L1948n1494P288Q3979K4377r2990N2379O2173n0225o9870R2556k5677
7385A48460R2360j09394O230n0038K1140O2024m0356M7378r8643J64433j57639
7374H5955q102J46632n1128R7100j05182N0184q219r2208N3699n0155J15093l2823
7362B00846M2964n681K5206j6598j9589o4872P4547l4742l5038P3094k20k2176
7350B17741p1683M9631K1711p7848J03100o3297Q8974j22176O7933n4645K8708
$$ y = [-94167, -212748, -196277, -91910, -210212, -229028, -227380, -136633, -170540, -150805, -187761, -119452, -77753, -110647, -114978, -100178, -79719, -86320, -152816, -47811, -82672, -40668, -92410, -107220, -151667, -124316, -91172, -112427, 12669, -88575, 83521, -39440, 81460, 48164, 84016, 115964, 64470, 71758, 155737, 180114, 87124, 139503, 201676, 151451, 81581, 174137, 148460, 240820, 131426, 137656, 87618, 108758, 170782, 130426, 177804, 79161, 243594, 85955, 77853, 224485, 173357, 270457, 165275, 215459, 207240, 115032, 168731, 118576, 233669, 200846, 243810, 238129, 263335, 246737, 227148, 162276, 236823, 202081, 167043, 240137, 239917, 217741, 146058, 195689, 217400, 139552, 242652, 179355, 268329, 146153, 214086, 159441, 188149]
7339A88149k014n9886N3705k2216J63214k20959J6002Q8940Q7013r7111q8732
7328A06105J57176j10455o7451R6076j9350O9456p8367J35140j12630J02941j65592
7317A13049L2314Q4749n2790O0144r2764r1443P7800j638M7702j96421J70591
7306A51293j02696L4016k0742L616P7722M7400q7282j822J02371r2910J10346
7295B21312p0488R7904m5698j32113J9139J13211m8051q8932J3123Q3982l7104
7284A26285m11k5785L5781N2876j24317N1263k068K4970R6429j11895J38293j942
7272B59479K4765l4783j14884M6423Q3947O035n4889J1140j9989N7344j05412
7261A59176P0570K1344L3514q8656L5270Q1589l4180J9075J7261Q5444m8414q88
$$ y = [188149, 186135, 126249, 179954, 157738, 320952, 99993, 115995, 204935, 291948, 194837, 106105, 263281, 152826, 85375, 181451, 162101, 231557, 153190, 288330, 175700, 278641, 113049, 145363, 230112, 177322, 237466, 144702, 53259, 131059, 129421, 177123, -19298, 151293, 48597, 82613, 61871, 65487, 143209, 190609, 103327, 101505, 203876, 110966, 221312, 150824, 248728, 203030, 70917, 90056, 203267, 155216, 66284, 79407, 163389, 126285, 125874, 100089, 135870, 188746, 64429, 115692, 113624, 138594, 235023, 123128, 261421, 259479, 284244, 249461, 134577, 181000, 264947, 270982, 216093, 227233, 207244, 264588, 159176, 229746, 251090, 284604, 195948, 231218, 312807, 278627, 297702, 314963, 400407, 351993, 351105]
7249C51105N7701J6241n2025j00193Q8412P7949R9306r7591l1734J64434o8241
7238E05364P6961J24217J29566K3082M0361J18766J82117Q8401N9906L8300k371
7227A384670R4842r5766R3978j9003j02110j08792k09829j9782j07877O071j11960
7216H04442J55596k6148O1376j0098R2278N1581J09743J74262K54365M2573K26691
7205A936661K13334J87768K27111j361j6230p0002j53603L5881r8540k54689m07343
7194A598987k06564n9853j57775q9435q7034Q006j66457J74451k4727Q1170N2077
7183A122846P1004O8588k4670K64693K7964J37513L2475K6254m6522N6673j37314
7172A599504k1612j65688J813j60726k52591L4960n2121k5957j37453J23594J5511
$$ y = [351105, 408806, 425047, 373022, 272829, 361241, 439190, 538496, 440905, 409171, 573605, 505364, 582325, 706542, 836108, 859190, 899551, 1018317, 1200434, 1288835, 1348741, 1387041, 1384670, 1479512, 1383746, 1477724, 1458721, 1356611, 1247819, 1037990, 1018208, 910331, 916402, 804442, 960038, 933890, 995266, 985168, 1077446, 1129027, 1238770, 1413032, 1667397, 1709970, 1936661, 2149995, 2337763, 2564874, 2563513, 2547283, 2477281, 2323678, 2359559, 2261019, 2006330, 1598987, 1392423, 1332570, 1174795, 1085360, 998326, 1006332, 839875, 1014326, 989599, 1070769, 1122846, 1193850, 1262438, 1237768, 1502461, 1530425, 1667938, 1700413, 1726667, 1680145, 1736818, 1599504, 1577892, 1412204, 1414017, 1253291, 1000700, 1035660, 983539, 957582, 820129, 943723, 959234]
7161I59234k2196m9648J5826K4158M3376r0151k239J16216k3153l8307O7447k1499
7149I79064k2043L8475L9267l1382L5806J029N7960j45685K2309N5491Q6464k4343
7137A092412P3086l0457K4833p034J134P5756j12910J63373o017J8158m6566J5896
7125A261664L9462p4559J58715j64927K4672N0208J3117R5674p1185M1895M352
7114A379088j4463J34294k6933n7366R7405o1525J28268q5681R0815J34041M7951
7103A765894j69205K0560J08500O5563m8438L6954J00282l7212O8745l6141J734
7092A877236J37049m3540k5086o847O5951J4716l5131Q1913O9203L4809K5798
7081B196071L101K8274M9614L1897N3937O3272K5003J79266o9397L8086K3126
$$ y = [959234, 937038, 887390, 903216, 927374, 970750, 880599, 878360, 994576, 971423, 933116, 1000563, 979064, 957021, 995496, 1034763, 1003381, 1039187, 1040216, 1098176, 952491, 974800, 1030291, 1116755, 1092412, 1165498, 1135041, 1159874, 1152840, 1153974, 1229730, 1116820, 1280193, 1274176, 1292334, 1245768, 1261664, 1301126, 1226567, 1385282, 1220355, 1245027, 1295235, 1308352, 1404026, 1332841, 1374736, 1379088, 1364625, 1498919, 1471986, 1414620, 1512025, 1450500, 1578768, 1493087, 1583902, 1717943, 1765894, 1596689, 1617249, 1725749, 1791312, 1742874, 1779828, 1880110, 1842898, 1911643, 1875502, 1877236, 2014285, 1970745, 1945659, 1938812, 2004763, 2019479, 1984348, 2066261, 2135464, 2170273, 2196071, 2199172, 2227446, 2277060, 2308957, 2362894, 2426166, 2451169, 2630435, 2561038, 2599124, 2622250]
7070B622250J46795n9181k6087N8408L2630o1842Q4015r1766J33700O7329l1596
7059B874655M4043L3279N82l1857J99128R6436P6642n1232J02636R2321J68825
7048C605458j12945L8796Q9949J50167r7973J47365P6469J06031Q011R428M7583
7037D068339M5019J55670K4368J47401M2155J743R4639J29651J32921n3462K48895
7026E037339k812N7261J11981K04177o546J72433k9313J29336J42688O3441J03582
7015E983567J50072K32129J9058L12252P0684M9889K54639Q2201J02889J02531
7005G359911L07595J11686R6524Q2343L37378J73441Q0054J81622K02411K73101
6995I206066J35661L16476J80943M12287J83823L23572N49417M28338M83913O08194
$$ y = [2622250, 2769045, 2709864, 2683777, 2742185, 2774815, 2712973, 2796988, 2705222, 2838922, 2906251, 2874655, 2918698, 2951977, 2952559, 2920702, 3119830, 3216266, 3292908, 3241676, 3344312, 3436633, 3605458, 3492513, 3531309, 3621258, 3771425, 3673452, 3820817, 3897286, 4003317, 4011328, 4020756, 4068339, 4113358, 4269028, 4293396, 4440797, 4482952, 4484695, 4579334, 4708985, 4841906, 4788444, 5037339, 5034527, 5091788, 5203769, 5407946, 5401400, 5573833, 5544520, 5673856, 5816544, 5879985, 5983567, 6133639, 6365768, 6384826, 6697078, 6767762, 6817651, 7072290, 7154491, 7257380, 7359911, 7667506, 7779192, 7875716, 7958059, 8295437, 8468878, 8548932, 8730554, 8932965, 9206066, 9341727, 9658203, 9839146, 10251433, 10435256, 10758828, 11308245, 11736583, 12220496, 12828690]
6985A2828690P47697Q02178R32503R60168J079164J020412J231086J587693J075325
6976B2264916k02950q80906r01192m60917k06574R8119K24339M23391M81482O60467
6966B1500175N16860Q14773P53654J087414J028210J216352J520456J846476K100382
6957C2384752K279168K431801K416456K456570L227372M051917L495130J215019
6949E3958185j72212k86566R31791J914334L718014N352655P078188R197097J0973081
6940I2664567J3347539J4506627J4729457J6896224K3079874K6325505J7074373
6933B18624166L89329j0014703q526772j75044M092522m367332j6825587k2527376
6925A60669203k0348269j5708731j1089487o758540l105375K56596L505114O940759
$$ y = [12828690, 13576387, 14378565, 15311068, 16271236, 17350400, 18370812, 19601898, 21189591, 22264916, 22061966, 21181060, 20279868, 19818951, 19612377, 19710496, 19934835, 20358226, 20839708, 21500175, 22017035, 22831808, 23585462, 24672876, 25701086, 26917438, 28437894, 30284370, 32384752, 34663920, 37095721, 39512177, 41968747, 45196119, 49248036, 52743166, 53958185, 53785973, 53499407, 54431198, 56345532, 60063546, 65416201, 72494389, 81691486, 92664567, 106012106, 120518733, 135248190, 152144414, 175224288, 201549793, 218624166, 219013495, 208998792, 200472020, 200296976, 204389498, 200022166, 183196579, 160669203, 140320934, 124612203, 113522716, 106764176, 103658801, 103915397, 107420511, 114361270]
6917A14361270J0756513J5082157J9312938K4341771K7751079K8680286L1092587
6910B71378601M2259440N3295987M2398940Q160322k1711163k3368711o762312
6903C65651104O62995j9125087m7333872n7115107n0188431l7953618k5900714
6896A28697270j7158444j1120668o874433l638192p89182K169127M820375P708521
6888A03814374J0544224J3532376J4640915J4504318J6926940K2903205K2586051
6881B19452403Q379968q278601j2645750o283277m666608j5293854k7164410l0586872
6873A22912999k6150379k0023229j3890389r796271o919056m924351l494130k285069
6865C5430125j511131q73320p13362P7644Q19402J099676q85969l079636l799809
$$ y = [114361270, 125117783, 140199940, 159512878, 183854649, 211605728, 240286014, 271378601, 313638041, 366934028, 409332968, 417493290, 395782127, 372413416, 365651104, 366314099, 347189012, 299855140, 242740033, 192551602, 154597984, 128697270, 111538826, 100418158, 93543725, 89905533, 89116351, 91285478, 96105853, 103814374, 114358598, 127890974, 142531889, 157036207, 173963147, 196866352, 219452403, 227832371, 219553770, 206908020, 200624743, 195958135, 180664281, 153499871, 122912999, 96762620, 76739391, 62849002, 53052731, 46133675, 41209324, 37715194, 35430125, 33918994, 33045674, 32332312, 32409956, 33229358, 34329034, 33443065, 30363429, 26563620]
6856B6563620l284923k514144j964654j265416j069558q63599p85817n40123o23133
6847A3652253l66314m08097l76817j80965j82138n1732P0343L26939L12028K63173
6837A3058673K59775M79016P52952O16015m03199j398525j496148j463117j046341
6828I359101p11434n98824k69320p34962j32802m27209j43799k81110k53208o6831
6818E739602l27671j04544j84412j26306j93113j24325j56253j42612k2327k03955
6808D154084r0504j30890K0499j27046j53300m3144j14320j9470n4038j56427
6798C285444Q1606j82898K3284j54024r8654l7576k0867q2081q8996J3000j02903
6787B635335j87657p501j43257N0286k28943N1239J8864j45263n8786o4130K2715
$$ y = [26563620, 23278697, 20764553, 18799899, 17534483, 16464925, 15601326, 14815509, 14275386, 13652253, 13285939, 12877842, 12501025, 12320060, 12137922, 12086190, 12156533, 12483472, 12795500, 13058673, 13318448, 13797464, 14550416, 15166431, 14763232, 13364707, 11868559, 10405442, 9359101, 8647667, 8048843, 7779523, 7044561, 6911759, 6484550, 6340751, 6059641, 5806433, 5739602, 5411931, 5307387, 5122975, 4996669, 4803556, 4679231, 4522978, 4380366, 4358039, 4154084, 4063580, 3932690, 3953189, 3826143, 3672843, 3629699, 3515379, 3495909, 3441871, 3285444, 3367050, 3184152, 3207436, 3053412, 2954758, 2917182, 2896315, 2814234, 2725238, 2738238, 2635335, 2447678, 2440177, 2296920, 2347206, 2118263, 2169502, 2188366, 2043103, 1984317, 1920187, 1942902]
6776A942902q1982q2261l9684l1483k9910K4197p8214j57178K8234q0628J7351
6765A431344j57073M6916j5596j6637P0927m5622j3055p4179L8667j1509q0121
6754A174062J4414J8271m5569K2690L7354l0677r5927n1331J0058j76446L2186
6743I09085m3764j19399N8086j22592L0237L868j03706Q8925j2972o0618J27485
6732G54635n2283j4877l9178J08692R4413j48921j146j5836K3872K1165j74372
6721E56164P0677J6890N6483j10662k404L2954J12572p6351r074l7621o619N3986
6709F56995j07810j44156J57283p8870K9266j34088K02283j14665j2286M916l5208
6698D23660L3912k54707J4077N5139N5116Q5771j14375n9975J78195q4673j16622
$$ y = [1942902, 1860920, 1778659, 1738975, 1707492, 1677582, 1701779, 1623565, 1466387, 1494621, 1413993, 1431344, 1274271, 1321187, 1305591, 1288954, 1359881, 1314259, 1301204, 1227025, 1265692, 1254183, 1174062, 1188476, 1206747, 1161178, 1183868, 1221222, 1190545, 1094618, 1043287, 1053345, 876899, 909085, 865321, 745922, 804008, 681416, 711653, 715521, 611815, 700740, 687768, 627150, 754635, 702352, 687475, 648297, 756989, 851402, 702481, 701335, 685499, 709371, 730536, 556164, 626841, 643731, 700214, 589552, 587148, 620102, 732674, 656323, 647249, 609628, 603009, 656995, 549185, 405029, 562312, 483442, 512708, 378620, 580903, 466238, 453952, 458868, 423660, 457572, 202865, 216942, 272081, 327197, 412968, 298593, 238618, 416813, 332140, 215518]
6687B15518J46936j03653M8539j25707J22113M6337j4680l938p4004J70446o3756
6676C64151L7950j87523J29976J8248m8324k1709k5771J05350j52727J5494N2190
6665B87305m1195m2379J52255j30747L4244Q1036r9357J18830q0981P9803J0468
6654C69282o683J28014p9668O7230m1950N4989l3906M67N2135P4646j19637K11886
6642F76805o1409P6779J15593k0776J20154J35032K33579J37014j07624J24446
6632A429593O54o3876L9637p9713j0345O6776k23208j35871k08924l4130l1179
6621G49414j0290k9021N1871K2432l6424J44264L624K46983O5208K43878K05156
6610A657095K45167K38800Q5053O4795q9726o8496l9319q1693p6488j59459k76577
$$ y = [215518, 362454, 258801, 307340, 181633, 303746, 350083, 335403, 331465, 257461, 427907, 364151, 402101, 214578, 344554, 362802, 314478, 292769, 266998, 372348, 219621, 235115, 287305, 246110, 203731, 355986, 225239, 259483, 340519, 241162, 359992, 279011, 358814, 369282, 362599, 490613, 410945, 478175, 436225, 491214, 457308, 457775, 509910, 584556, 464919, 676805, 615396, 692175, 807768, 786992, 907146, 1042178, 1275757, 1412771, 1305147, 1429593, 1430247, 1366371, 1406008, 1326295, 1315950, 1382726, 1159518, 1023647, 814723, 780593, 749414, 739124, 710103, 761974, 784406, 747982, 892246, 895870, 1142853, 1208061, 1451939, 1657095, 1902262, 2141062, 2226115, 2290910, 2201184, 2132688, 2093369, 2011676, 1935188, 1775729, 1499152]
6599A499152j95605j11006k58629k45876L5400j97754P3724j11915K0053N4005
6589E61549m486J44275P3462J15212J01562Q9326J08696L3186Q7379m9113o953
6578A254095j64685M7564p7499j64036k99787M3750J9505j31162p3140j22096
6568C32509J15849j45866O1277l6314j0527P261o6703m111R2738r384p6519l8674
6556B21536l1499J13629j96307K3662J14852n4457r0345L6664n359j5302O0104
6545A77178J1850p2825N4467K8090l1867N5617q5982k7249J38688k3202j0886
6534B13879l5443J37716j0534q2511m571J12203j35450L3009P4676K8385o2644
6523B68715l728J0962R3287j49294P3780p6993P5239J81603j38601J17180n1141
$$ y = [1499152, 1303547, 1192541, 933912, 688036, 723436, 525682, 599406, 487491, 507544, 561549, 557063, 701338, 774800, 890012, 991574, 1080900, 1189596, 1222782, 1310161, 1261048, 1254095, 1089410, 1136974, 1059475, 895439, 595652, 639402, 658907, 527745, 454605, 332509, 448358, 302492, 363769, 327455, 316928, 324189, 257486, 253375, 346113, 336729, 260210, 221536, 190037, 303666, 107359, 131021, 245873, 191416, 101071, 137735, 132376, 117074, 177178, 189028, 116203, 170670, 198760, 166893, 222510, 136528, 109279, 247967, 224765, 213879, 178436, 316152, 305618, 223107, 218536, 330739, 195289, 228298, 302974, 331359, 268715, 264987, 275949, 369236, 219942, 293722, 216729, 291968, 473571, 334970, 452150, 401009]
6512D01009J12004q3525N3506l4687J53746q4635m9631M8676K9934N9667q8309
6501E17755P1501P151J9201M7114j13518O0875O01j21658q1475J08146m5405M1041
6489E11329n150N8388p1900R7246o9540l4426N5357o0901L8218K9921k7389m6088
6477D75065m6513P5642k3473N882j04557J92300p6602J1370l8753J75702q8938
6466E57125j31483J77671L3878p3477J4007j6157J1139l6867J43329m4830j13270
6455E21065M981P3934j79735J19719l3403P2622l1383o8818o9731N2497o9412
6444C92336m1974J8740L3799L0182m1283J9423M158M1470P5218k37030L597L2187
6432C30823j5601P5152p5242L2583r2754p8516L4580l566m4322p412l7166M0461
$$ y = [401009, 513013, 429488, 482994, 448307, 602053, 517418, 467787, 516463, 546397, 606064, 517755, 589256, 596407, 615608, 662722, 549204, 610079, 610680, 489022, 407547, 515693, 470288, 511329, 506179, 564567, 492667, 589913, 520373, 485947, 541304, 480403, 518621, 548542, 521153, 475065, 428552, 504194, 480721, 486603, 382046, 574346, 497744, 509114, 470361, 646063, 557125, 425642, 603313, 637191, 563714, 577721, 561564, 572703, 535836, 679165, 634335, 521065, 526046, 599980, 420245, 539964, 506561, 579183, 547800, 478982, 409251, 461748, 392336, 350362, 369102, 402901, 433083, 391800, 411223, 415381, 456851, 532069, 295039, 298636, 330823, 315222, 390374, 315132, 347715, 254961, 176445, 211025, 207459, 163137, 155725, 118559, 159020]
6420A59020o1281K9117L7169m7396r0266J05926l983J68720k23134M1026J1322
6409A26240K7424J01007j91120J23791p5570L1240O9855j32883R0489p0662Q6851
6398A86662p5867K4677n64M5079n2858K6435K3511q732j83091J05470P4220R5926
6386B60868j22625J07665L2385o2921M9714j20002J24359k2212k7708P1816K0877
6375C12216j32186O4686o5075N3990J31240j09482J28421n5428R2937j05502J3338
6364C29155M4270o1570J24303j42009J2849J50427l5784l7289R0695q7756J51937
6353E39228j38605P6665J2563M6288R1411l8313K1002O4750m5852o5016M6321
6342F10442Q4175j0112P5397r4453J26223O6035N786P3933L4855Q3579J07004
$$ y = [159020, 97739, 126856, 164025, 116629, 26363, 132289, 128306, 297026, 73892, 114918, 126240, 153664, 254671, 63551, 187342, 111772, 143012, 212867, 79984, 170473, 99811, 186662, 110795, 135472, 134908, 179987, 127129, 153564, 177075, 168343, -14748, 90722, 164942, 260868, 138243, 245908, 278293, 215372, 265086, 145084, 269443, 247231, 219523, 291339, 312216, 180030, 244716, 179641, 233631, 364871, 255389, 383810, 328382, 421319, 315817, 329155, 373425, 311855, 436158, 294149, 306998, 457425, 421641, 384352, 475047, 387291, 539228, 400623, 477288, 489851, 536139, 627550, 589237, 610239, 674989, 629137, 564121, 610442, 694617, 684505, 759902, 665449, 791672, 857707, 863493, 937426, 972281, 1055860, 1162864]
6331A162864M1022J15928O6481N8751K63989K4934Q6051j13311P2861P9735p184
6320A852121M3819q6719K14148p6575J0846J11787J71114L2565j66855J56834
6310B263085n487l794n4378N1161m4074J18515q5260P5815R8044p5250Q7460j15732
6298B310105K4172Q0530k9833l9166l5632K8185k39338J38161k0203L1398p8288
6287B170091R8231q5293M9278j15007k61958j21910j50488p0947q7057o0453p5688
6276A288799M5960j0987R7973j10529m7200M6485k0581k1000J03174l5135k4695
6265A312264q6080k95968j6362r7462j44280J15964j22425Q6252j69046N4465
6255F37322l9428l6758J38890j67137J81181q2837m9010Q3258j52571R2434p96
$$ y = [1162864, 1203886, 1319814, 1386295, 1445046, 1709035, 1733969, 1820020, 1706709, 1779570, 1859305, 1852121, 1895940, 1809221, 2023369, 1946794, 1957640, 2069427, 2240541, 2273106, 2106251, 2263085, 2257598, 2253804, 2199426, 2250587, 2206513, 2325028, 2239768, 2315583, 2413627, 2338377, 2425837, 2310105, 2334277, 2414807, 2384974, 2345808, 2310176, 2338361, 2099023, 2237184, 2216981, 2248379, 2170091, 2268322, 2183029, 2232307, 2117300, 1855342, 1733432, 1582944, 1511997, 1424940, 1364487, 1288799, 1334759, 1323772, 1421745, 1311216, 1264016, 1310501, 1289920, 1268920, 1372094, 1336959, 1312264, 1226184, 930216, 913854, 816392, 672112, 788076, 665651, 751903, 582857, 637322, 597894, 561136, 700026, 532889, 714070, 631233, 582223, 665481, 512910, 605344, 604548]
6244F04548J1981l7581L8359m9664r5712J12473m3129J8526n1317l175O3962K9013
6232E98284N1286r6047R0008m0495m1864M9819J57951q4462m0898O7713l5914
6221F75381p9528L7506L1343O1774j05199K740l4523J37186o3763k0035J46743
6210G89625l7856M3744j1994Q2342J7364m3178M3608J1413l1887K59096M6472
6199A168749Q1515N1167J14564P295k7552L1857l7412K3413J0727M5287J1393
6188A481003k2577k8148j74934l6702L0533k988j28466J46652L1524l5807J23312
6177A383402K3709J08524M3101K0987K25774J58050m9466O5274P6118k7114n8026
6166A970333j00541J24971j59416j27103j94305k40789J05458k36279M3292L9655
$$ y = [604548, 616529, 578948, 617307, 567643, 471931, 584404, 541275, 559801, 508484, 505309, 569271, 598284, 649570, 553523, 643531, 603036, 561172, 610991, 768942, 684480, 643582, 711295, 675381, 595853, 633359, 664702, 726476, 621277, 624017, 589494, 726680, 662917, 642882, 789625, 751769, 795513, 783519, 865861, 883225, 840047, 883655, 895068, 863181, 1122277, 1168749, 1250264, 1301431, 1415995, 1423290, 1395738, 1427595, 1390183, 1413596, 1424323, 1469610, 1481003, 1458426, 1430278, 1255344, 1218642, 1249175, 1246187, 1117721, 1264373, 1295897, 1260090, 1383402, 1407111, 1515635, 1558736, 1579723, 1805497, 1963547, 1914081, 1979355, 2055473, 2028359, 1970333, 1869792, 1994763, 1835347, 1708244, 1513939, 1273150, 1378608, 1142329, 1185621, 1225276]
6156A225276p6922Q0309O3571j1216J6161R9378M2574q5251J60182J26380m5886
6145A594556p3077j6397J73137j26857j4325j58239N0938o7887k7283m5263N4571
6134A343874O871j47476J08556m1023K95P5132j57481P1317N3872l5087q346N3985
6122A324489L6363l4790m2183j18776R6006J2262j19860j5553J32494P3215k04552
6111A139115N2363p1565O0861J63184j87760N9167l1130j1563k55052J77123L6763
6100A131506j02050p7578l1087J22597j59487K65778k47120j930J29117j56751
6090H72995R6382j41330J09125j04383K2252K4402p8562Q2520k25233J55590q0263
6079G33495O3316m5191J01171q7362J20551k2523p4328P2918o7004j6171j29160
$$ y = [1225276, 1148354, 1228663, 1292234, 1281018, 1297179, 1396557, 1439131, 1353880, 1514062, 1640442, 1594556, 1521479, 1505082, 1678219, 1551362, 1537037, 1378798, 1429736, 1361849, 1334566, 1289303, 1343874, 1350745, 1203269, 1311825, 1270802, 1271097, 1346229, 1188748, 1260065, 1313937, 1278850, 1270504, 1324489, 1360852, 1326062, 1283879, 1165103, 1261109, 1273371, 1153511, 1137958, 1270452, 1343667, 1139115, 1191478, 1119913, 1180774, 1343958, 1156198, 1215365, 1184235, 1172672, 917620, 1094743, 1131506, 1029456, 951878, 920791, 1043388, 883901, 1149679, 902559, 900629, 1029746, 872995, 969377, 828047, 937172, 832789, 855041, 879443, 800881, 883401, 658168, 813758, 733495, 796811, 751620, 852791, 765429, 885980, 863457, 789129, 862047, 795043, 778872, 649712]
6068F49712N5471n7351R5576o9369K5040Q3135J8920j38678m6035O3370j0295
6057F69496m5538j31452N9267L754O5428n1353o4267J16608r9591J06955j70215
6046D59092J43606l2243l7873L2501J34899j348p5957R3274j7434m0633O421J08669
6034G72974o9154L9320R2950J25504j93026j8989J34802p6698J00415r1312N5997
6023H72783Q7760j89049J98986N978o984P2632o695m1208J39205k53063O6947
6012I47292R9068j72332K9261o4476K4882L9877r7443Q127p9526R4072J1060j42269
6000F97593O7727l0041k8197J0541M388m9836L1114L8274J00358j65465J4777
5989F91233J39920m5101O4525L3814k3185Q7314m4784R1134Q461J18469j29400
$$ y = [649712, 705183, 647832, 743408, 674039, 699079, 782214, 801134, 662456, 616421, 679791, 669496, 623958, 492506, 551773, 555527, 620955, 569602, 505335, 621943, 522352, 629307, 459092, 602698, 570455, 532582, 565083, 699982, 698634, 622677, 715951, 698517, 657884, 664305, 772974, 703820, 743140, 836090, 961594, 768568, 749579, 884381, 807683, 908098, 816786, 872783, 960543, 771494, 970480, 976458, 969474, 1042106, 1035411, 994203, 1133408, 880345, 947292, 1046360, 874028, 903289, 838813, 863695, 903572, 806129, 814256, 734730, 828802, 839862, 697593, 765320, 735279, 707082, 717623, 722011, 672175, 703289, 741563, 841921, 676456, 691233, 831153, 786052, 850577, 884391, 861206, 948520, 903736, 994870, 1003331, 1121800, 992400]
5978I92400J16019l2687L2554O3746M4477p7617M4096m1921J59427k2883Q50j25527
5966A152934K1151m8196J68729r8373P0199j16725l4198p3714L1957K0426j45920
5955I48270k015n681p2837J5712n5471R3365q4201j14572L1964o804J39657j35140
5943G52247N3158R777o0447O0490j15706J49228q5975J37953m0443K2435O8455
5932I51172K7361l9174o3377J10531j59874J69600l5883P9469J8590j95258R6310
5921I59467o467N2626Q2967o4780K127P1850K1509j36992O2174M7383L4992j16408
5909A010448J40748n7P1597o4208p670J17005K537j10472R5130q832P3480j681
5897A318025j05766R9088Q2452r009k6416P8004R6289q6629N2363k324m3186P5084
$$ y = [992400, 1108419, 1075732, 1108286, 1172032, 1216509, 1138892, 1182988, 1141067, 1300494, 1277611, 1278461, 1152934, 1174085, 1125889, 1294618, 1196245, 1266444, 1149719, 1115521, 1041807, 1073764, 1094190, 948270, 946255, 940574, 867737, 883449, 827978, 921343, 837142, 722570, 754534, 747730, 887387, 752247, 805405, 815182, 754735, 815225, 699519, 848747, 762772, 900725, 860282, 882717, 951172, 978533, 939359, 875982, 986513, 826639, 996239, 960356, 1039825, 1058415, 863157, 959467, 953000, 1005626, 1088593, 1023813, 1025940, 1097790, 1119299, 982307, 1044481, 1091864, 1126856, 1010448, 1151196, 1151139, 1222736, 1158528, 1150858, 1267863, 1270400, 1159928, 1255058, 1246226, 1319706, 1318025, 1212259, 1311347, 1393799, 1384790, 1358374, 1436378, 1532667, 1446038, 1498401, 1496077, 1452891, 1527975]
5885A527975J4546L6074J30773q3154J6372q739J4859J93675j33257O212M5860
5874A761196O5348J4975q5359R4962R5658P1702j18076J06344l3162O0728l1261
5863B003055k4920o7478P2874J43272k6967R570P6821J05100o4758O074P7965
5852B310608R3430j3501K5992N1385J0002R6317n3748J89386L7522p4774J39748
5841B812367O8903l0472K24125j01191Q9048J00659Q8410R8558n6300J62075L8311
5830C494493r896Q9690J10014J19067j7848J08370J3940K05059L7851J33631k4466
5819D259905J43670K29968Q961M9870K15325J28908L2294K2090K45552P3140J28588
5808E538271R8180K13295J84303K21709P2796K16712K18052K36493J62144L11055
$$ y = [1527975, 1542521, 1578595, 1709368, 1626214, 1642586, 1633847, 1648706, 1842381, 1709124, 1715336, 1761196, 1826544, 1841519, 1756160, 1851122, 1946780, 2018482, 1900406, 2006750, 1973588, 2034316, 2003055, 1978135, 1910657, 1983531, 2126803, 2099836, 2109406, 2186227, 2291327, 2226569, 2232643, 2310608, 2404038, 2390537, 2416529, 2467914, 2477916, 2574233, 2520485, 2709871, 2747393, 2672619, 2812367, 2881270, 2850798, 3074923, 2973732, 3062780, 3163439, 3251849, 3350407, 3294107, 3456182, 3494493, 3484597, 3574287, 3684301, 3803368, 3785520, 3893890, 3907830, 4112889, 4150740, 4284371, 4259905, 4403575, 4633543, 4642504, 4692374, 4907699, 5036607, 5068901, 5090991, 5336543, 5409683, 5538271, 5636451, 5849746, 6034049, 6255758, 6328554, 6545266, 6763318, 6999811, 7161955, 7473010]
5798G473010K72239K36625J75034K49152K61239L31089K58755K83629M37493M80463
5788A0458728M14462M54284N07523M84960N36636O90500N58189Q37594P89827
5779A5732703P43471R82529Q94737J481506J255143J805571K245245K716873K666478
5770C0524256L191281L570943M190357M997029N641218N691779M725411L762037
5762F6294311K556779K853412M127002N088935M575993L554279K626307K244428
5754I3921446J679269J012597R25569J709581K892240K646301J061611j211371
5746A04637243k766231l168058k532979j613790j144698j806731l983488n213946
5738H2407322n977520o111647n910770m481722k914028k327548k664076l735499
$$ y = [7473010, 7745249, 7981874, 8156908, 8406060, 8667299, 8998388, 9257143, 9540772, 9978265, 10458728, 10873190, 11327474, 11834997, 12319957, 12856593, 13547093, 14105282, 14942876, 15732703, 16476174, 17458703, 18353440, 19834946, 21090089, 22895660, 25140905, 27857778, 30524256, 33715537, 37286480, 41476837, 46473866, 52115084, 57806863, 62532274, 66294311, 68851090, 71704502, 75831504, 80920439, 85496432, 89050711, 91677018, 93921446, 95600715, 96613312, 97538881, 99248462, 102140702, 104787003, 105848614, 104637243, 101871012, 98702954, 96169975, 94556185, 93411487, 91604756, 87621268, 82407322, 76429802, 70318155, 64407385, 59925663, 57011635, 54684087, 52020011, 48284512]
5730D8284512l830169l503727k489353j135136j59417Q97598J457732K212569
5722D1734609L021638L339435M194640N198502O501014O940363P220298O759091
5714H4909590O019948M910283M961472N760595O747449O324968N209243L812749
5706A28656297J928635j225286l817803m170602k468226p40387k83100J58520
5698A18038048J66637J139662Q24826l79933k185543l415143m611177o181410
5690A03395967p650559r050840r424724q848960p464650o318733n906331n881245
5682D2849925o065834n660573m740567l752311k993657k171250j569594j327423
5674A4568716j036312q20326p68189o09415o58538m60671m66805k76418m51834
$$ y = [48284512, 44454343, 40950616, 38461263, 37326127, 37166710, 38064308, 39522040, 41734609, 44756247, 48095682, 52290322, 57488824, 63989838, 70930201, 78150499, 84909590, 90929538, 95839821, 100801293, 106561888, 113309337, 119634305, 124843548, 128656297, 130584932, 129359646, 125541843, 121371241, 118903015, 118162628, 117879528, 118038048, 118204685, 119344347, 120169173, 119789240, 117603697, 114188554, 109577377, 103395967, 95745408, 86694568, 77269844, 68420884, 60956234, 54637501, 48731170, 42849925, 36784091, 31123518, 26382951, 22630640, 19636983, 17465733, 15896139, 14568716, 13532404, 12712078, 11943889, 11334474, 10675936, 10215265, 9748460, 9472042, 9020208]
5665I020208l53600k89312l04147L3542l31597j62265k67786L3032r0127j40993
5655G146955k08484l32503J4481j12408l07113m9456l1003n881j70536R6897j39654
5644E901295N3100M0768M0865p3497N2173j40572j7740p0169j05898p6972j82582
5633E420771Q5048j33408p5291r7992J2153j06041j08424P469j16813j20280o5960
5622D701232j15643j77300Q457l722j07694n1578p3740m0337l4414Q6528p9522
5611D112267M9409m297j36623J54061j61726Q6235k1246q6855O3684N3621j04599
5600D003931j5838K6552R348m0036M6014m4982M0916L6590j54436J89237p6532
5589D020764m3194J729p6359n8007j5438M7728j39463Q4374q7895K8918P486k7198
$$ y = [9020208, 8666608, 8377296, 8073149, 8106691, 7775094, 7612829, 7345043, 7378075, 7287948, 7146955, 6938471, 6605968, 6620449, 6508041, 6200928, 6151472, 6120469, 6114588, 5944052, 6040949, 5901295, 5954395, 5995163, 6036028, 5962531, 6014704, 5874132, 5856392, 5786223, 5680325, 5603353, 5420771, 5505819, 5372411, 5297120, 5199128, 5211281, 5105240, 4996816, 5004285, 4887472, 4767192, 4701232, 4585589, 4408289, 4416746, 4413024, 4305330, 4253752, 4180012, 4139675, 4105261, 4191789, 4112267, 4161676, 4157379, 4020756, 4174817, 4013091, 4099326, 4078080, 3991225, 4054909, 4108530, 4003931, 3988093, 4014645, 4023993, 3983957, 4029971, 3984989, 4025905, 4062495, 3908059, 4097296, 4020764, 3977570, 3979299, 3902940, 3844933, 3829495, 3877223, 3737760, 3822134, 3734239, 3763157, 3770643, 3743445]
5577C743445J568l7125j03020M0970K531L6105k1927r6293O5686p588J54456j7194
5565C761614L20l302k1276O9934O075K3082k7300O1559l3929l4475j1450k951
5553C787901R1341k625J9889m1466J97489M0147j09469K17475j9547J57304j74586
5542D163853O2553J5448N9422R2841n2594R0979n8205J26914j3220Q9454R1053
5531D668498Q6977k1898O2202R4727J01641J5525J14897M1055K0481k6555J51991
5520E309541j413N9027J61818q6833j387J37657k8109j8950J08412J98102J04882
5509E942747J5499k5728J56361J08571Q5321J45852M2963K05872O6031J09712
5499F853201J85367j13242K34304N2403J25403K1944K35408J21830J63163J09614
$$ y = [3743445, 3745013, 3707888, 3604868, 3645838, 3648369, 3684474, 3662547, 3566254, 3631940, 3624352, 3778808, 3761614, 3761934, 3758632, 3737356, 3807290, 3813365, 3836447, 3809147, 3870706, 3836777, 3802302, 3790852, 3787901, 3879242, 3876617, 3896506, 3855040, 4052529, 4092676, 3983207, 4200682, 4181135, 4338439, 4163853, 4226406, 4241854, 4301276, 4394117, 4341523, 4432502, 4374297, 4501211, 4487991, 4577445, 4668498, 4755475, 4733577, 4795779, 4890506, 4992147, 5007672, 5122569, 5163624, 5184105, 5157550, 5309541, 5308128, 5367155, 5528973, 5442140, 5440753, 5578410, 5550301, 5531351, 5639763, 5837865, 5942747, 5958246, 5932518, 6088879, 6197450, 6282771, 6428623, 6471586, 6677458, 6743489, 6853201, 7038568, 6925326, 7159630, 7212033, 7337436, 7359380, 7594788, 7716618, 7879781, 7989395]
5489G989395K07890J96168K03041J62274K03525K33435J98251K09671K13719L34739
5479A0152108J42621K65611L16180K42803K26690J87496L51077L58015M48869
5470A2691470K24358L38538L30866L89799L18601M01588M11798N20133N83426
5461A6210577N64407P16324R99020Q17649P31195O12199O92181O13719Q04774
5452B2762045P47086P21600P41345R47800R63353J266042J540530K047720K382365
5443C4119886L038578L548190L880739M453554N002400O108808O428322O411681
5435G2992158N561188M518180L846371L364090M887541Q606110J0925935P373535
5427A22075108P25575l463601m895621n065248l921464k502571j228131K80811
$$ y = [7989395, 8197285, 8393453, 8596494, 8758768, 8962293, 9195728, 9393979, 9603650, 9817369, 10152108, 10294729, 10560340, 10876520, 11119323, 11346013, 11533509, 11884586, 12242601, 12691470, 12915828, 13254366, 13585232, 13975031, 14293632, 14695220, 15107018, 15627151, 16210577, 16774984, 17491308, 18490328, 19307977, 20039172, 20651371, 21343552, 21957271, 22762045, 23509131, 24230731, 24972076, 25919876, 26883229, 28149271, 29689801, 31737521, 34119886, 37158464, 40706654, 44587393, 49040947, 54043347, 60152155, 66580477, 72992158, 78553346, 83071526, 86917897, 90281987, 95169528, 103775638, 114701573, 122075108, 122800683, 119337082, 114441461, 109376213, 105454749, 102952178, 101724047, 102004858]
5419A02004858L575859P511364P919348M303829R64864P40904J146102J077341
5411A29244469J40143J39293p41385j004387j299361j696114j131062L08095J801063
5402A25760754K051413J499385J289817J683694K030823J021604K61706n6720
5394A35542476P61710J444653J095859J256783K820278N454684Q614285J0613369
5386A67604097J1841521J1868414J0586765P329998K426981j956526n834832r285125
5378A94581293r783632n907850j395359J324804J995238J991354L603460M242101
5370A90651409K219087k941278q044120r955523r740854r020671r685076r168306
5362A34314668o738514l624668k488890l445269m473602m256791l091206l756457
$$ y = [102004858, 105580717, 113092081, 121011429, 125315258, 126280122, 127021026, 128167128, 129244469, 129384612, 129523905, 128782520, 127778133, 126478772, 124782658, 123651596, 123959691, 125760754, 127812167, 129311552, 130601369, 132285063, 134315886, 135337490, 135599196, 135542476, 136304186, 137748839, 138844698, 140101481, 142921759, 148376443, 156990728, 167604097, 179445618, 191314032, 201900797, 209230795, 211657776, 209701250, 203866418, 194581293, 184797661, 178889811, 177494452, 178819256, 180814494, 182805848, 186409308, 190651409, 192870496, 189929218, 181885098, 171929575, 162188721, 153168050, 143482974, 134314668, 127576154, 123951486, 121462596, 118017327, 113543725, 109286934, 106195728, 102439271]
5354A02439271n528138p313111p342360o038394m097596j672644M79127K124645
5346G3050800L212181M404227N661741O461302N500114K987909Q63486k11105
5338A01930655k08818J025370K366006L766755L286755M83356m038931q466454
5330A00144694j0306537j0324256q615525n987978m054177k304456q39192J97899
5322E7910472j115121m584647p313668p365902o133905m691396l451162k719535
5314B0535136k115160j574622j322289j019876q48462n36072n47625l80241l58239
5305A1832550j29129j05027j98195j80964m91390m46449k39409m49108j82975
5296I409904k87687k47710j42076j90344k681Q3620p3918r2455Q8573j88342j79252
$$ y = [102439271, 96911133, 89598022, 82255662, 76217268, 72119672, 70447028, 70926155, 73050800, 76262981, 80667208, 86328949, 92790251, 98290365, 101278274, 102141760, 101930655, 101721837, 102747207, 105113213, 108879968, 112166723, 112650079, 108611148, 100144694, 89838157, 79513901, 70898376, 64910398, 60856221, 58551765, 57712573, 57910472, 56795351, 52210704, 44897036, 37531134, 31397229, 26705833, 23254671, 20535136, 18419976, 16845354, 15523065, 14503189, 13654727, 13118655, 12571030, 12190789, 11832550, 11703421, 11598394, 11400199, 11219235, 10727845, 10281396, 10041987, 9592879, 9409904, 9122217, 8874507, 8732431, 8542087, 8539406, 8623026, 8549108, 8456653, 8545226, 8356884, 8177632]
5285H177632r8210j16580k5302m86542k23949k27439l71536j89188k85940j81323
5275E971623k01288k72158l39498j17431j21471k22655j27458n5060q9777k39685
5265D185142J11912k31841m7489n9513p2744o4659j3921j9609j2177j87642K0587
5254C608046L9677j25991M5755j55104N2j49027j00851L6594o679j91244k9840
5243B971388Q5836j93187N0928j58781N6114l7551l1514o5414p2157n5892L6079
5232B585849l7833r8480O5835q0715l3598m0090j07093M7028J01917k20227q776
5221B173817J11121q3488p3273o868M3049n2712m3714Q9855n8516K0794n5465
5210B064600j59n5478l1940j31932P2981j24769O9171j37050O5643K3301j25310
$$ y = [8177632, 8079422, 7962842, 7937540, 7450998, 7227049, 6999610, 6628074, 6438886, 6152946, 5971623, 5770335, 5498177, 5158679, 5041248, 4919777, 4697122, 4569664, 4514604, 4424827, 4185142, 4297054, 4065213, 4017724, 3958211, 3885467, 3820808, 3806887, 3787278, 3775101, 3587459, 3608046, 3647723, 3521732, 3567487, 3412383, 3412435, 3263408, 3162557, 3199151, 3192472, 3001228, 2971388, 3057224, 2864037, 2914965, 2756184, 2812298, 2774747, 2743233, 2677819, 2605662, 2549770, 2585849, 2548016, 2449536, 2515371, 2434656, 2401058, 2360968, 2253875, 2300903, 2402820, 2182593, 2173817, 2284938, 2201450, 2128177, 2121309, 2164358, 2111646, 2067932, 2157787, 2099271, 2120065, 2064600, 2064441, 2008963, 1977023, 1845091, 1918072, 1793303, 1862474, 1725424, 1791067, 1814368, 1689058]
5199A689058J0808j2069k694J06112n9971J3235l7151o9667J94812m608k4354
5188A803511j12188k3675k8329l6221J4010l3644j307J17863j22445J30265k8491
5177A679349Q3233M0857K35613k8961L8845J03847l1079J15316K43651j6480N2935
5166B517126o4919o5420R804k1387J92098O7222k61034N0110j86012L8401j37825
5155B138164r803J0736p8174L9236K778O669R3016l0924k2135O0545r8977J06892
5143B218023k6027k7169l6484j03703L4979J1602O5286r5008N8564j2800L0468
5132B117731J22091M8670J3355o4711M120O4224n6150O9979J65471J4550M9917
5121B549247O995j2105k5553K4701j59421K9394J4874O7576n539J1039K6844K11672
$$ y = [1689058, 1699866, 1687797, 1685103, 1791215, 1731244, 1744479, 1707328, 1637661, 1832473, 1827865, 1803511, 1691323, 1667648, 1639319, 1603098, 1617108, 1583464, 1582157, 1700020, 1577575, 1707840, 1679349, 1762582, 1803439, 2039052, 2010091, 2048936, 2152783, 2121704, 2237020, 2480671, 2464191, 2517126, 2452207, 2386787, 2396591, 2375204, 2567302, 2634524, 2373490, 2423600, 2237588, 2275989, 2138164, 2128361, 2139097, 2060923, 2100159, 2102937, 2109606, 2202622, 2171698, 2149563, 2210108, 2111131, 2218023, 2191996, 2164827, 2128343, 2024640, 2059619, 2071221, 2136507, 2041499, 2100063, 2087263, 2117731, 2239822, 2288492, 2301847, 2237136, 2241256, 2305480, 2249330, 2319309, 2484780, 2499330, 2549247, 2556242, 2544137, 2518584, 2543285, 2383864, 2413258, 2428132, 2495708, 2490169, 2501208, 2528052, 2739724]
5109B739724j65131O5256l468p8080p5463j46531O8532n4488p1331j12256J62838
5098B329602j73824K6987N506J9136Q1923J8960l3902P5547J33976J05465K20326
5087B809702J20931N3181J28903M33086L62178j48314l17267l99833m34899m8018
5077B559650j86756k9314r6997o4704J9445q9250K5360q4842l6200J07381j38214
5066A985559N6554j55962J83374J2296j24407J5061q7938N8502n5078j49488J42788
5055A881261l5682Q420p2509J70765o8095O2741j43174J42509k4538j10971J28508
5044A939235j5672J4108j6915J11705j12622O7820O1044j31510P8167q7706J07689
5033B015343R448L8964J13121J299J34057K3872j2148J06342J38347N8386J70558
$$ y = [2739724, 2574593, 2639849, 2636381, 2558301, 2482838, 2336307, 2404839, 2350351, 2279020, 2166764, 2329602, 2155778, 2182765, 2188271, 2207407, 2289330, 2308290, 2274388, 2349935, 2483911, 2589376, 2809702, 2930633, 2983814, 3112717, 3545803, 3907981, 3759667, 3442400, 3042567, 2607668, 2559650, 2372894, 2343580, 2246583, 2181879, 2201324, 2112074, 2137434, 2052592, 2016392, 2123773, 1985559, 2042113, 1886151, 2069525, 2081821, 1957414, 1972475, 1884537, 1943039, 1887961, 1738473, 1881261, 1845579, 1853999, 1781490, 1952255, 1884160, 1946901, 1803727, 1946236, 1921698, 1810727, 1939235, 1923563, 1937671, 1920756, 2032461, 1919839, 1987659, 2048703, 1917193, 1995360, 1907654, 2015343, 2024791, 2063755, 2176876, 2178175, 2312232, 2336104, 2323956, 2430298, 2568645, 2627031, 2797589]
5022B797589n4424J00095K1729M1111k8833K39860J60185n5149r5808q4338j8910
5011C023107j11914k8518L573j00820r921k9370j06632n8026J01274m2819m8224
5000B591710j33894J83426j94408Q5918J19774j07741L5440P4252N9138m8873
4990B664742j4515J16140P1722L2383J46010m2227L3125O5158R5085N1429J06331
4979C325383q2335k4980p1513o7748M4101M1953P9780L5553L5958R5308J06459
4968C517919O8559L4482j32301J93583m3243J11695M7289R5046Q9760J32945J17811
4957D233545R0225J20514j28501O5258k20797j34352k3045n475j07185M9476J90995
4946D130658K4345R4554P4760J08885J68444j82765p7800p8707p689j14619R7486
$$ y = [2797589, 2743165, 2843260, 2864989, 2906100, 2877267, 3117127, 3277312, 3222163, 3126355, 3042017, 3023107, 2911193, 2882675, 2886248, 2785428, 2775507, 2746137, 2639505, 2581479, 2682753, 2639934, 2591710, 2457816, 2641242, 2446834, 2532752, 2652526, 2544785, 2580225, 2654477, 2713615, 2664742, 2650227, 2766367, 2838089, 2870472, 3016482, 2974255, 3007380, 3072538, 3167623, 3219052, 3325383, 3243048, 3218068, 3146555, 3078807, 3122908, 3164861, 3244641, 3280194, 3316152, 3411460, 3517919, 3586478, 3620960, 3488659, 3682242, 3638999, 3750694, 3797983, 3893029, 3982789, 4115734, 4233545, 4323770, 4444284, 4315783, 4381041, 4160244, 4025892, 4002847, 3997372, 3890187, 3939663, 4130658, 4155003, 4249557, 4324317, 4433202, 4601646, 4418881, 4341081, 4262374, 4254685, 4140066, 4237552]
4935D237552K8727J11231L4798R3179k3188j72144J30399j97306M0618j40144
4925D143722R0868n5248M4557J98211J39488M7666J49101J4144J68544J80228
4915E121281O626m8775l3105j69804J3255p0629J5711K20719M1778K6520r0048
4904E033529J37703j94612J09866N8402M5909j0610o929J45899O5167J74371N4360
4893E613055j8776K19420Q0908J5547L4434J93271q9660P2509q7406J61514l6819
4882F157997J02780j9810J38895M0965P9212J28254o8389K64738O501O1862J30853
4871G023858J45049J75802m302J36699J55351K33444J91910O9496J03388K29120
4861H459815P3479K08797K22173J67233J19202M5878N9689n0936K49389J01691
$$ y = [4237552, 4266279, 4377510, 4412308, 4505487, 4482299, 4310155, 4440554, 4243248, 4283866, 4143722, 4234590, 4179342, 4223899, 4422110, 4561598, 4609264, 4758365, 4772509, 4941053, 5121281, 5127907, 5079132, 5046027, 4876223, 4889478, 4818849, 4834560, 5055279, 5097057, 5123577, 5033529, 5171232, 4976620, 5086486, 5144888, 5190797, 5180187, 5173258, 5319157, 5384324, 5558695, 5613055, 5594279, 5813699, 5894607, 5910154, 5944588, 6137859, 6048199, 6120708, 6033302, 6194816, 6157997, 6260777, 6240967, 6379862, 6420827, 6500039, 6628293, 6559904, 6824642, 6831143, 6893005, 7023858, 7168907, 7344709, 7340407, 7477106, 7632457, 7865901, 8057811, 8127307, 8230695, 8459815, 8533294, 8742091, 8964264, 9131497, 9250699, 9296577, 9356266, 9305330, 9554719, 9656410]
4851I656410o232J86524j60727K07494L5939J59554J48706N5411Q4674K20049
4841A0587802P4605J43993K44479j00430L00954J31504J77048o7094J59122J07578
4831A1759561J71410K30820K4684J41959K14501J35246J25683K62707K89259L12179
4821A3668009M34843L64421N00741K74810M54494O10186M07944N73116K84588
4812A7573152M80796K59330Q5359N14306L86618M26995N34516N10616M44537P22831
4802B1939056O83410R04794R88513J211815J278320J209081J141446J176345J176825
4793C1709605J038912J043516R61666J652349K050912K094430P51737J99108J60765
4784D1663000N6188J54303N40339J065788J699639J848069J866859J460561J928371
$$ y = [9656410, 9650178, 9836702, 9675975, 9883469, 9919408, 10078962, 10227668, 10283079, 10367753, 10587802, 10662407, 10806400, 11050879, 10950449, 11251403, 11382907, 11559955, 11492861, 11651983, 11759561, 11930971, 12161791, 12186475, 12328434, 12542935, 12678181, 12803864, 13066571, 13355830, 13668009, 14102852, 14467273, 14968014, 15242824, 15697318, 16307504, 16715448, 17288564, 17573152, 18053948, 18313278, 18398637, 18912943, 19299561, 19726556, 20261072, 20771688, 21216225, 21939056, 22622466, 23527260, 24515773, 25727588, 27005908, 28214989, 29356435, 30532780, 31709605, 32748517, 33792033, 34753699, 36406048, 38456960, 40551390, 41303127, 41502235, 41663000, 41719188, 41873491, 42413830, 43479618, 45179257, 47027326, 48894185, 50354746, 52283117]
4775E2283117K067070K511398K287200K140331J956738K420596L243660M376688
4767G3286798N799026N718099M891216L800451M087432L483425J172570q63497
4759A01375520k262798k870411k404915p05161R62795K554189L068384L087276
4751A02804879K554477K760771M062435M830955M984842M845235M426736M122027
4743A35392357L904990M220467O359248Q261460P062798L671073J930791K718874
4735A73522058K436509L925368Q687590J3032253R011234j933105p334085n986509
4727A95361313k271472O27666K937579M899701N481492O740926R613993J2782519
4719B36173717Q875423j444104p329975o821851l205327K172244O860278Q911580
$$ y = [52283117, 54350187, 56861585, 59148785, 61289116, 63245854, 65666450, 68910110, 73286798, 79085824, 84803923, 89695139, 93495590, 97583022, 101066447, 102239017, 101375520, 99112722, 96242311, 93837396, 93132235, 94095030, 96649219, 99717603, 102804879, 105359356, 108120127, 112182562, 117013517, 121998359, 126843594, 131270330, 135392357, 139297347, 143517814, 149877062, 158138522, 165201320, 168872393, 170803184, 173522058, 175958567, 179883935, 188571525, 201603778, 210615012, 208681907, 201347822, 195361313, 193089841, 193717507, 196655086, 201554787, 207036279, 213777205, 223391198, 236173717, 245049140, 243605036, 236275061, 229453210, 226247883, 228420127, 235280405, 244191985]
4711B44191985J0966377J5000828J6075615J2888781R969756J1413247M111976
4704C24618565j6169688k8935098k8047274j9588527r579848p32968M816418N290813
4696B31672393Q015845J6378046K5486585K0515505N63608j5532870k4435606
4689B62663506k5115867j7295047p766534j844575L136906J1624523J9555303
4682B44958215J5637576k01211j0767141j3677549j8248257k0686422j6397309
4675A80617902r397343k217286M220919Q971447J1832671J4769395J7158471K0655149
4667B46611325K3358578K0399870P012031j4848976k5846804k3247186j6597886
4660B16840952j0016129n770193p70628N257504Q190860J811755p660258j1460152
$$ y = [244191985, 255158362, 270159190, 286234805, 299123586, 309093342, 320506589, 324618565, 308448877, 279513779, 251466505, 231877978, 222298130, 221565162, 226381580, 231672393, 239688238, 256066284, 281552869, 302068374, 302631982, 287099112, 262663506, 237547639, 220252592, 212486058, 210641483, 213778389, 225402912, 244958215, 260595791, 260394580, 249627439, 235949890, 217701633, 197015211, 180617902, 171220559, 169003273, 173224192, 182195639, 194028310, 208797705, 225956176, 246611325, 269969903, 290369773, 297381804, 282532828, 256686024, 233438838, 216840952, 206824823, 201054630, 200284002, 205541506, 213732366, 215544121, 207883863, 196423711]
4652A96423711r866876o762559l184107j312655j079916q25852J24726K157160
4644A75673632L351704K975027K550410M970128Q020636N309984m448127j1403314
4636A87000080j3679896j4596916j3778207j1754368r626585p134891n689452
4629A10739765n389833m826651l848990k672005j871880j582518r55200R1875
4621H9684563J126374K288455M080221N215913N771313N706277N834080N968108
4613A25675304O791833P490127P877154Q285090Q256070P887023O174583M376999
4605A82814183L167136J749499R37331J594506K176019K349544J771470O86429
4597A97246117J869395M414405O991202P028635N000581K492514J241498J69040
$$ y = [196423711, 186556835, 179794276, 176610169, 175297514, 174217598, 173391746, 173516472, 175673632, 179025336, 182000363, 184550773, 189520901, 197541537, 202851521, 198403394, 187000080, 173320184, 158723268, 144945061, 133190693, 123564108, 116429217, 110739765, 105349932, 100523281, 96674291, 94002286, 92130406, 90547888, 89592688, 89684563, 90810937, 93099392, 97179613, 102395526, 108166839, 113873116, 119707196, 125675304, 132467137, 139957264, 147834418, 156119508, 164375578, 172262601, 178437184, 182814183, 185981319, 187730818, 188668149, 190262655, 192438674, 194788218, 196559688, 197246117, 199115512, 203529917, 210521119, 217549754, 222550335, 225042849, 226284347, 226453387]
4589B26453387j687946l959373n277332o781303p809045n548144k129042j008098
4581A92253104k538854m002771l476690l200712l806404m677510o222780p323336
4573A57004047o520847m428761k291186l6155J002373J189596J015102K291536
4565A49225705L834736M819957M933645M166887L877973O128869P126302M713416
4557A88827490J198038j348420m38404K354803N045560N367247K733162L03613
4549B04043089O09405L102245M537320M849759M938923O851218R197713J0062055
4541B48191727R007054O874921N366589N946902P128641P259023O045574L651595
4533B99472026R10888j030933l239979o349807j0935257j3768738j4770823j5022969
$$ y = [226453387, 224765441, 220806068, 215528736, 208747433, 200938388, 195390244, 193261202, 192253104, 189714250, 185711479, 182234789, 179034077, 175227673, 170550163, 164327383, 157004047, 150483200, 146054439, 143763253, 143727098, 144729471, 145919067, 146934169, 149225705, 153060441, 157880398, 162814043, 166980930, 170858903, 176987772, 184114074, 188827490, 190025528, 188677108, 188238704, 190593507, 195639067, 201006314, 203739476, 204043089, 204652494, 207754739, 212292059, 217141818, 222080741, 228931959, 238129672, 248191727, 257198781, 264073702, 269440291, 275387193, 282515834, 289774857, 295820431, 299472026, 300382914, 299351981, 296112002, 289762195, 278826938, 265058200, 250287377, 235264408]
4525B35264408j4833432j4786801j4689675j3729267j2031284j0449397q980777
4518A45763775q294696p414715o366892n892367n422180n504745m877692m130481
4510I7860007l444614k759011k099501k104511k588468l015427l516102l089533
4502G5242840k859564j869341j513648j560414k074772k416245j977039j983226
4494E8988591j204208o33691r0881O62060P54585J057916P23125p966K78366J630739
4484F2158636K235323L87356k466839l440140l082895k188598r77280j24848P10747
4475E3211462J031602R66460J393665K254410K976127J553345j125141k681872
4467E9580058k737740k977036k927271k440106j625427p64419m2929M13348Q71043
$$ y = [235264408, 220430976, 205644175, 190954500, 177225233, 165193949, 154744552, 145763775, 137469079, 130054364, 123687472, 117795105, 112372925, 106868180, 101990488, 97860007, 94415393, 91656382, 89556881, 87452370, 84863902, 81848475, 78332373, 75242840, 72383276, 70513935, 69000287, 67439873, 65365101, 62948856, 60971817, 58988591, 57784383, 57150692, 57059811, 57721871, 58476456, 59534372, 60257497, 60249531, 60527897, 62158636, 64393959, 64781315, 62314476, 58874336, 55791441, 53602843, 52625563, 52500715, 53211462, 54243064, 55209524, 56603189, 58857599, 61833726, 63387071, 62261930, 59580058, 56842318, 53865282, 50938011, 48497905, 46872478, 46108059, 46065130, 46478478, 47349521]
4458D7349521J064415R32167N45851j56451k64697P1484K81669N80561J00569
4449E0505089J00775L26285J066337J711255K725052L465259L862286N132539
4441F8894877N581121N417068N579105O836791P560132L822941j616439l187479
4433I8888117j724676L97411K597684M288870N666602O638669O899902O916416
4425A30568995P070654O113335O98596n368136o490993m634436l810721m657767
4417A19489527n235224m326628j802109J742721L937987L918474J972852Q63764
4409A20561364j226102l551716m381126l027430k86142K906813M085702K701864
4401A17783227J441785J788680K985495N008346N892196M918311M684392O365262
$$ y = [47349521, 48413936, 49346103, 49891954, 49735503, 49470806, 49542290, 49823959, 50404520, 50505089, 50605864, 50932149, 51998486, 53709741, 56434793, 59900052, 63762338, 68894877, 74475998, 79893066, 85472171, 92308962, 99869094, 103692035, 102075596, 98888117, 97163441, 97560852, 100158536, 104447406, 110114008, 116752677, 123652579, 130568995, 137639649, 143752984, 144451580, 139083444, 132592451, 127958015, 124147294, 119489527, 114254303, 109927675, 108125566, 109868287, 113806274, 117724748, 119697600, 120561364, 119335262, 115783546, 111402420, 108374990, 108088848, 110995661, 115081363, 117783227, 119225012, 121013692, 123999187, 129007533, 134899729, 139818040, 144502432, 150867694]
4393A50867694Q528860R482770P875583O425828Q314357J0164118P944079K523691
4385B12126980k675392m555965l910675l170827k040257L01678N79672j623055
4377A95032159l346252l277893l935184o310970o530672n483678p758030j0345421
4369A48044059j0037209p213977n538921l781035l197040k319172n4925J638232
4361A17540012R29100k418722m169089m068790k814462j07501J639504R98043
4353A07528095o10912k357431l352937l391846k908825m08033L125927N259222
4345A02883260M920571L925528M328579L626453L079555R75395m697713r482897
4337A09558731j1950050j0510056p003185m095542k369048k872970l376521l170183
$$ y = [150867694, 159396554, 168879324, 176754907, 183180735, 191495092, 201659210, 209603289, 212126980, 209451588, 204895623, 200984948, 197814121, 195773864, 196075542, 196655214, 195032159, 191685907, 188408014, 184472830, 178161860, 171631188, 166147510, 158389480, 148044059, 138006850, 130792873, 125253952, 121472917, 118275877, 115956705, 115901780, 117540012, 118469112, 116050390, 111881301, 107812511, 104998049, 104890548, 106530052, 107528095, 106917183, 104559752, 101206815, 97814969, 94906144, 94498111, 97624038, 102883260, 107803831, 111729359, 116057938, 119684391, 122763946, 123739341, 119041628, 109558731, 97608681, 87098625, 80095440, 75999898, 73630850, 70757880, 67381359, 64211176]
4329F4211176l556523k959758j497995K13559P90045j264387m212498n054876
4321D6668743m925999l663572k756329j692542j274814r00755n97397n5928K17620
4312C1019027K24003P8815K43640M43978J293009J437987N49609p04239r55394
4303C3630435j038958o65931k11893K58673P27312Q06867J337471J862761J825769
4294C8532506Q15559J00474m34160r90527j326816j693705j379070j073559m95148
4285C2055554l06272k99484m93290o93647o56342m06768l86706m00613p55760
4276B7656672r56073j099949j439135j279383j196916q70530o26369m68528k92903
4267A9426886l72720j80702o4997R7007L65126M20113P44381R62347J448321J629002
$$ y = [64211176, 60654653, 57694895, 56196900, 56410459, 57200504, 55936117, 51723619, 46668743, 41742744, 38079172, 35322843, 33630301, 32355487, 31454732, 30857335, 30801407, 31019027, 31243030, 31321845, 31565485, 32009463, 33302472, 34740459, 35290068, 34585829, 33630435, 32591477, 31925546, 31713653, 31972326, 32699638, 33506505, 34843976, 36706737, 38532506, 39348065, 39448539, 39014379, 38023852, 36697036, 35003331, 33624261, 32550702, 32055554, 31749282, 31449798, 30956508, 30262861, 29606519, 29199751, 28813045, 28412432, 27656672, 26700599, 25600650, 24161515, 22882132, 21685216, 20814686, 20188317, 19719789, 19426886, 19054166, 18873464, 18808467, 18905474, 19270600, 19690713, 20435094, 21397441, 22845762, 24474764]
4257B4474764K194100K433176K994496K708874K912680L872340M633436L771940
4249D9995806J93531k113330l123852k312103j352545p38068L01688J102746K022175
4240D3976048K209723K175976K426033L177632M037551K636541k92866l055042
4232E7291596m293315m301239l300569k578637j765054j602364j355806j181481
4224C6913131q32599l75345k81391j35138k57073K94187P49902J400201J958190
4215C9434065K236830K775376L191182L525691L495597M171766M923705M982175
4207F8736387K972020R19981Q2949J06700J464822L047533L545418K758689R02103
4198H4536602q05220j430637j197631J62661J916615L352660K450111o1906k052849
$$ y = [24474764, 26668864, 29102040, 32096536, 34805410, 37718090, 41590430, 46223866, 49995806, 50189337, 48076007, 44952155, 42640052, 41287507, 40549439, 40851127, 41953873, 43976048, 46185771, 48361747, 50787780, 53965412, 58002963, 60639504, 60346638, 57291596, 52998281, 48697042, 45396473, 42817836, 41052782, 39450418, 38094612, 36913131, 36080532, 35705187, 35423796, 35288658, 35031585, 35325772, 36075674, 37475875, 39434065, 41670895, 44446271, 47637453, 51163144, 54658741, 58830507, 63754212, 68736387, 71708407, 72628388, 72711337, 72818037, 74282859, 77330392, 80875810, 83634499, 84536602, 83731382, 82300745, 81103114, 81265775, 83182390, 86535050, 88985161, 88923255, 86870406]
4189H6870406k045057j053765J192015J401758j654057n188207p007391o588537
4181F5927165n458612m604221l910605l634640k874532k069933j092418l48671
4173D1933533O9721K54689L83873L44117M92699Q91956J266856J730510K200779
4164D9568733K514162K768212K762312L220774M513526M730395K980322p05950
4156G2352486l616918l988179k904018j031162j08049K49118k86346k63866K92887
$$ y = [86870406, 84825349, 83771584, 84963599, 86365357, 84711300, 79523093, 72515702, 65927165, 60468553, 55864332, 51953727, 48319087, 45444555, 43374622, 42282204, 41933533, 42003254, 42257943, 42641816, 42985933, 43478632, 44370588, 45637444, 47367954, 49568733, 52082895, 54851107, 57613419, 60834193, 65347719, 70078114, 73058436, 72352486, 68735568, 64747389, 61843371, 60812209, 60704160, 60953278, 60666932, 60403066, 60695953]
$$ [...]
##END NTUPLES=NMR SPECTRUM
##END=
